{"text_format":"1","workbook":"xlsx","n_sheets":3,"sheets":["Feuil1","Feuil2","Feuil3"],"not_rendered":{"charts":6,"images":0,"macros":0,"external_links":0,"defined_names":6,"comments":1,"pivot_tables":0},"unopened":[],"bounds":{"document_bytes":16777216,"sheet_cells":100000,"rows_first":2000,"rows_last":500,"rows_between":2000,"halvings":0,"cell_chars":16384,"cell_head_chars":4096},"cells_cut":0,"cells_raw":0,"read":"whole","date_system":"1900"}

{"sheet":"Feuil1","index":0,"n_rows":31,"n_cols":19,"rows_kept":31,"cut":false,"hidden":false,"merged":[]}
[]
[null,"Electronic temperature, density and excitation class derived from planetary nebula spectrum",null,null,null,null,null,null,null,null,null,null,null,null,null,null,null,null,"F. Teyssier 2011"]
[]
[null,1,2,3,4,5,6,null,"Balmer Decrement"]
[null,"l","Line","I0 Gauss","I0                  I(Hb) =100","Ic","D%",null,"n","Line","Measured value","Theorical value","Dereddened value"]
[]
[null,4340.47,"H I",23.7,{"$f":"+D7/D$10*100","v":43.807763401109057},{"$f":"+E7*10^(J$11*((2.5634*(B7/10000)^2-4.873*(B7/10000)+1.7636)))","v":45.462450010559465},{"$f":"-(E7-F7)/F7*100","v":3.6396776000107294},null,3,"Ha",{"$f":"+E16/100","v":3.0979667282809604},2.86,{"$f":"+F16/F10","v":2.8218954987137805}]
[null,4363.21,"[O III]",7,12.939001848428836,13.404989914636737,{"$f":"+(E8-F8)/F8*100","v":-3.4762283983451145},null,4,"Hb",1,1,{"$f":"+F10/F10","v":1}]
[null,4685.68,"He II",16.600000000000001,30.683918669131238,31.059078971726535,-1.2078925551424449,null,5,"Hg",{"$f":"+E7/100","v":0.43807763401109057},0.46899999999999997,{"$f":"+F7/F10","v":0.4545642067744356}]
[null,4861.33,"H I",54.1,100,100.01326398565054,-1.3262226550712582E-2]
[null,4958.92,"[O III]",179,330.86876155268021,328.7735197409848,0.63729031868080344,null,"c(Hb)",{"$f":"3.08*LOG(E16)-7.55","v":0.1225163874980808},null,"E(B-V)",{"$f":"+J11/1.46","v":8.391533390279507E-2}]
[null,5006.8500000000004,"[O III]",552.9,1021.9963031423289,1012.346047861558,0.95325657675611619]
[null,5754.57,"[N II]",0.8,1.478743068391867,1.4008855059632634,5.5577391654907489,null,"l 5007/l 4959",{"$f":"+F12/F11","v":3.0791593211615917},"l 6583/l 6548",{"$f":"+F17/F15","v":3.0283431313591747},"l 6583/l 6562",{"$f":"+F17/F16","v":0.27481985453282998}]
[null,5875.65,"HeI",6,11.090573012939002,10.438970970086348,6.2420141287859483,null,null,null,null,1,2,3,4,5]
[null,6548.06,"[N II]",15.2,28.096118299445472,25.611885468091611,9.6995312369674025,null,"R[OIII]",{"$f":"+(F12+F11)/E8","v":103.6493837247108},"T(K)",{"$f":"3.29*10000/LN($J15/7.9)","v":12780.912344200062},{"$f":"14320/(LOG(RO)-0.89)","v":12722.479877758115},{"$f":"-32990/(LN(1/(RO*0.132)))","v":12610.564448625826},{"$f":"3.29*10000/LN($J15/8.32)","v":13043.383603012593},{"$f":"14516/(LOG(J15)-0.871411)","v":12687.084190274094}]
[null,6562.82,"H I",167.6,309.79667282809606,282.22697945278031,9.7686243281105121,null,null,null,null,6,7,8,"4b"]
[null,6583.39,"[N II]",46.1,85.212569316081328,77.561577438453085,9.8644098409415193,null,"R[NII]",{"$f":"+(F17+F15)/F13","v":73.648747501032602},"T(K)",{"$f":"2.5*10000/(LN($J$17/8.23))","v":11407.601665013046},{"$f":"10860/(LOG(J17)-0.81)","v":10272.754249049563},{"$f":"10697.5/(LOG(J17)-0.888527)","v":10931.004115036436},{"$f":"2.5*10000/(LN($J$17/6.91))","v":10564.849693563523}]
[null,6716.5,"[S II]",3.9,7.208872458410351,6.5256425307509049,10.469925749684403,null,null,null,null,9]
[null,6730.7,"[S II]",6.1,11.275415896487983,10.200945599482825,10.533046044865021,null,"R[SII]",{"$f":"+F18/F19","v":0.63970957075604307},"Ne (cm-3)",{"$f":"100*SQRT(L17)*(J19-1.49)/(5.62-12.8*J19)","v":3536.0766560122661}]
[null,null,null,null,null,null,null,null,null,null,null," 1/6"," 2/7",null,"4/4b"]
[null,"References",null,null,null,null,null,null,null,null,"T[OIII]/T[NII]",{"$f":"+L15/L17","v":1.1203855744191122},{"$f":"+N15/M17","v":1.2275738465945059},null,{"$f":"+O15/O17","v":1.2346019092878415}]
[null," 1,6","Osterbrock & Ferland, University Science Books, 2006"]
[null,"2,7","Kaler, A.J., 308, 1986",null,null,null,null,null,"Excitation Class",null,null,"Class","Scale"]
[null,3,"Kwok, Cambridge astrophysics series, 2007"]
[null,"4,4b","Acker, EDP Sciences, 2011",null,null,null,null,null,"Gurzadyan 1998             10",null,{"$f":"IF(F9>1,LOG((F12+F11)/F9),(F12+F11)/F10)","v":1.6352789261484681},{"$f":"IF(F9>1,VLOOKUP(K25,Feuil3!U7:V15,2,TRUE),VLOOKUP(K25,Feuil3!U3:V5,2))","v":9},"[1-12]",{"$f":"CONCATENATE(VLOOKUP(L25,Feuil3!X3:Y14,2),\" excitation\")","v":"high excitation"}]
[null,"5,8","McKenna & al., P.A.S.P, 108, 1996"]
[null,9,"Acker & Jaschek, Masson, 1995",null,null,null,null,null,"Dopita 1990",11,{"$f":"+IF($F$9>1,5.54*($F$9/$F$10+0.78))","v":6.041644775485504},{"$f":"+INT(K27)","v":6},"[1-10]",{"$f":"10^(4.489+0.1124*K27-0.00172*K27^2)","v":127437.82234013747}]
[null,10,"Gurzadyan & Egikyan, A.P. Supp. Ser., 181,1991",null,null,null,null,null,null,null,null,null,null,"T* [K]"]
[null,11,"Dopita & Meatheringham, A.J., 357, 1990",null,null,null,null,null,"Reid 2011",12,{"$f":"+IF($F$9>1,5.54*(F9/F10+LOG((F11+F12)/F10)))","v":7.9662956114738126},{"$f":"+INT(K29)","v":7},"[1-10]",{"$f":"10^(4.439+0.1174*K29-0.00172*K29^2)","v":184114.79794617722}]
[null,12]
[null,12,"Kaler & Jacony, A.J., 345, 1989",null,null,null,null,null,null,null,null,null,null,{"$f":"10^(4.905+1.011162*0.01*F9-1.10692*0.0001*F9^2+6.20572*0.0000001*F9^3)","v":135166.82519765678},"Kaler, 1989",null,{"$f":"+I25","v":"Gurzadyan 1998             10"},{"$f":"+I27","v":"Dopita 1990"},"Reid 2011"]

{"sheet":"Feuil2","index":1,"n_rows":17,"n_cols":9,"rows_kept":17,"cut":false,"hidden":false,"merged":[]}
[]
[null,null,null,null,"This Work","[1]","[2]","[3]","[4]"]
[]
[null,4340.47,"H I",null,{"$f":"+Feuil1!F7","v":45.462450010559465},46,48,48,47.333333333333336]
[null,4363.21,"[O III]",null,{"$f":"+Feuil1!F8","v":13.404989914636737},14,25,19.5,19.5]
[null,4685.68,"He II",null,{"$f":"+Feuil1!F9","v":31.059078971726535},38,38,35,37]
[null,5006.8500000000004,"[O III]",null,{"$f":"+Feuil1!F12","v":1012.346047861558},950,1200,1260,1136.6666666666667]
[null,5754.57,"[N II]",null,{"$f":"+Feuil1!F13","v":1.4008855059632634},2,1.6,1.51,1.7033333333333334]
[null,5875.65,"HeI",null,{"$f":"+Feuil1!F14","v":10.438970970086348},6.8,7.8,7.45,7.3500000000000005]
[null,6562.82,"H I",null,{"$f":"+Feuil1!F16","v":282.22697945278031},275,295,283,284.33333333333331]
[null,6583.39,"[N II]",null,{"$f":"+Feuil1!F17","v":77.561577438453085},95,95,85.5,91.833333333333329]
[null,6716.5,"[S II]",null,{"$f":"+Feuil1!F18","v":6.5256425307509049},8,6.7,4.8,6.5]
[null,6730.7,"[S II]",null,{"$f":"+Feuil1!F19","v":10.200945599482825},10,7.9,7.8,8.5666666666666664]
[]
[null,"Table 5 : Line intensities - Comparison with published values"]
[null,"[1] : Henry & al. (2000) [2] : Barker (1991) [3] Aller & Czyzak (1979) "]
[null,"[4] Average of [1], [2] and [3] as computed in Pottasch & al. (2008)"]

{"sheet":"Feuil3","index":2,"n_rows":145,"n_cols":36,"rows_kept":145,"cut":false,"hidden":false,"merged":[]}
[]
["Te","R[OIII]",null,"Te","R[NII]",null,null,"Ne",null,"R[SII]",null,null,null,null,null,null,null,null,null,null,null,null,null,null,null,null,null,"Low Excitation"]
[null,null,null,null,null,null,null,null,null,5000,10000,15000,20000,null,null,null,null,null,null,null,2.5,1,null,1,"low",null,"R1"," 1-5","5-10","10-20"]
[null,null,null,null,null,null,null,null,null,null,null,null,null,null,null,null,null,null,null,null,7.5,2,null,2,"low",null,"EC",1,2,3]
[6000,{"$f":"8.32*EXP((3.29*10000)/A5)","v":2002.1874526144493},null,{"$f":"+A5","v":6000},{"$f":"8.23*EXP((2.5*10000)/D5)","v":530.83576592376301},null,1,{"$f":"10^(G5)","v":10},{"$f":"0.01*H5/SQRT(J$3)","v":1.414213562373095E-3},{"$f":"1.49*(1+3.77*0.01*$H5/SQRT(J$3))/(1+12.8*0.01*$H5/SQRT(J$3))","v":1.4713104969259714},{"$f":"1.49*(1+3.77*0.01*$H5/SQRT(K$3))/(1+12.8*0.01*$H5/SQRT(K$3))","v":1.476715343601896},{"$f":"1.49*(1+3.77*0.01*$H5/SQRT(L$3))/(1+12.8*0.01*$H5/SQRT(L$3))","v":1.4791279093703726},{"$f":"1.49*(1+3.77*0.01*$H5/SQRT(M$3))/(1+12.8*0.01*$H5/SQRT(M$3))","v":1.4805714280825577},null,null,null,null,null,null,null,15,3,null,3,"low"]
[6100,1830.0615475006769,null,6100,495.78713456625337,null,1.1000000000000001,12.58925411794168,1.780389391375446E-3,{"$f":"1.49*(1+3.77*I6)/(1+12.8*I6)","v":1.4665791326324749},{"$f":"1.49*(1+3.77*0.01*$H6/SQRT(K$3))/(1+12.8*0.01*$H6/SQRT(K$3))","v":1.4733301581816227},1.4763494062213725,1.4781576351605954,null,null,null,null,null,null,null,null,null,null,4,"medium",null,null,"Medium Excitation",null,null,null,null,"High Excitation"]
[6200,1677.5905855845631,null,6200,464.07402642263622,null,1.2,15.848931924611136,2.2413774476912991E-3,1.4606840039726572,1.4690997335947071,1.4728725117687969,1.4751347092824274,null,null,null,null,null,null,null,1,12,null,5,"medium",null,"R2",2.7,2.5,2.2999999999999998,2.1,1.9,1.7,1.5,1.2,0.9]
[6300,1542.0754410066265,null,6300,435.30197382213277,null,1.3,19.952623149688804,2.8217270263209289E-3,1.45335795079393,1.463822890687287,1.4685283575957877,1.471353984078654,null,null,null,null,null,null,null,1.3,11,null,6,"medium",null,"EC",4,5,6,7,8,9,10,11,12]
[6400,1421.2431918996042,null,6400,409.13125224186854,null,1.4,25.118864315095799,3.5523438585818045E-3,1.4442830297851481,1.4572561080356026,1.4631110203193294,1.4666333796723567,null,null,null,null,null,null,null,1.4,10,null,7,"medium"]
[6500,1313.1718068758496,null,6500,385.26825613660657,null,1.5,31.622776601683803,4.4721359549995806E-3,1.4330866619401124,1.4491077064319509,1.4563715171102778,1.4607515166255534,null,null,null,null,null,null,null,1.6,9,null,8,"medium"]
[6600,1216.2294530666702,null,6600,363.45838366595319,null,1.6,39.810717055349755,5.6300855987473503E-3,1.4193409392658651,1.4390330347570817,1.4480120586655625,1.4534417312158854,null,null,null,null,null,null,null,1.8,8,null,9,"high"]
[6700,1129.0253484542402,null,6700,343.48014167412026,null,1.7,50.118723362727238,7.087857830839415E-3,1.4025672947279955,1.4266319464856267,1.4376814305291303,1.4443866266948047,null,null,null,null,null,null,null,2,7,null,10,"high"]
[6800,1050.369776185504,null,6800,325.14024194267984,null,1.8,63.095734448019364,8.9230843384280282E-3,1.3822493673318128,1.4114504438501032,1.424972856468729,1.4332141974124462,null,null,null,null,null,null,null,2.2000000000000002,6,null,11,"high"]
[6900,979.24140644930878,null,6900,308.26950619678564,null,1.9,79.432823472428197,1.1233497625229587E-2,1.3578572962815105,1.3929890152304973,1.4094262972497609,1.4194970928846828,null,null,null,null,null,null,null,2.4,5,null,12,"high"]
[7000,914.76047480166778,null,7000,292.7194337063674,null,2,100,1.4142135623730951E-2,1.3288864717290032,1.3707207446808509,1.3905377859155441,1.4027572190501525,null,null,null,null,null,null,null,2.8,4]
[7100,856.16667565240334,null,7100,278.35931392019205,null,2.1,125.89254117941677,1.7803893913754455E-2,1.2949124251793813,1.3441224317607265,1.3677789258657684,1.3824785027898772]
[7200,802.80086891536837,null,7200,265.07378916649776,null,2.2000000000000002,158.48931924611153,2.2413774476913013E-2,1.2556605211027843,1.3127212622968281,1.3406297622475285,1.3581310518102321]
[7300,754.08988358485544,null,7300,252.76079038941421,null,2.2999999999999998,199.52623149688802,2.8217270263209283E-2,1.2110841984633729,1.2761574539198215,1.3086273999517439,1.3292097443336905]
[7400,709.5338469222894,null,7400,241.3297831891856,null,2.4,251.18864315095806,3.5523438585818051E-2,1.1614393314263318,1.2342593305496135,1.2714304197586221,1.2952889532592902]
[7500,668.69558153912601,null,7500,230.70027288195013,null,2.5,316.22776601683825,4.4721359549995836E-2,1.1073367498552347,1.1871215887597166,1.2288949450049622,1.256092107257903]
[7600,631.1917021241884,null,7600,220.80052649746912,null,2.6,398.10717055349761,5.6300855987473516E-2,1.0497531712451209,1.1351713350854871,1.1811523699665534,1.2115698966433095]
[7700,596.68511433008234,null,7700,211.56647706026288,null,2.7,501.18723362727269,7.0878578308394197E-2,0.98998578767760537,1.0792023689672672,1.1286726660493889,1.1619747581040687]
[7800,564.8786745522915,null,7800,202.94078151659497,null,2.8,630.95734448019323,8.9230843384280223E-2,0.92954833184508001,1.0203594550957198,1.0722935466842458,1.1079137226876594]
[7900,535.5098141827043,null,7900,194.8720085623824,null,2.9,794.32823472428208,0.1123349762522959,0.8700233671782942,0.96006320321588123,1.0131978780452351,1.0503598666915717]
[8000,508.34596784069959,null,8000,187.31393661972498,null,3,1000,0.1414213562373095,0.81290000077570634,0.89988157894736831,0.95283151814480715,0.99060751723968976]
[8100,483.18067396860471,null,8100,180.22494547919837,null,3.1,1258.925411794168,0.17803893913754459,0.75943131293705701,{"$f":"1.49*(1+3.77*0.01*$H26/SQRT(K$3))/(1+12.8*0.01*$H26/SQRT(K$3))","v":0.84137073416018981},0.89276967422692133,0.93016887554994498]
[8200,459.83023949085725,null,8200,173.5674878113137,null,3.2,1584.8931924611156,0.22413774476913015,0.71053893747706476,0.78591835009483846,0.83455618838161127,0.87062662785879286]
[8300,438.1308791209687,null,8300,167.30762896481377,null,3.3,1995.2623149688804,0.28217270263209288,0.66677688947202018,0.73462180359330453,0.77954948921222222,0.81347163206606055]
[8400,417.93625525257346,null,8400,161.41464530044902,null,3.4,2511.8864315095811,0.35523438585818062,0.62835010426358384,0.68822164900456384,0.72880660754481574,0.75995998320732228]
[8500,399.11535689420333,null,8500,155.86067282753228,null,3.5,3162.2776601683804,0.44721359549995804,0.59517164326911609,0.64709397578176986,0.68302384458624654,0.71101701636354875]
[8600,381.55066635717242,null,8600,150.62039917392696,null,3.6,3981.0717055349769,0.5630085598747353,0.56693871441220423,0.61129050459045753,0.64253564851338696,0.66720052144458186]
[8700,365.13657082206845,null,8700,145.67079297412735,null,3.7,5011.8723362727324,0.70878578308394269,0.54321024387154171,0.58060753952382327,0.60735922245170448,0.62871878715264418]
[8800,349.77798284149833,null,8800,140.99086564189295,null,3.8,6309.5734448019384,0.89230843384280301,0.52347454519598779,0.55466458805190244,0.57726558387629856,0.59548750958542274]
[8900,335.38913956400495,null,8900,136.56146123364877,null,3.9,7943.2823472428154,1.1233497625229583,0.50720170537544662,0.5329780651149395,0.55185824506227699,0.56720571523565144]
[9000,321.8925552099023,null,9000,132.36507073107805,null,4,10000,1.4142135623730949,0.49387994128095158,0.51502173913043481,0.53064565000069253,0.5434333861694346]
[9100,309.21810527363925,null,9100,128.38566759603816,null,4.0999999999999996,12589.254117941671,1.7803893913754447,0.48303791481493236,0.50027106542621402,0.51309975384964979,0.52365926810115837]
[9200,{"$f":"8.32*EXP((3.29*10000)/A37)","v":297.30222421391426},null,{"$f":"+A37","v":9200},{"$f":"8.23*EXP((2.5*10000)/D37)","v":124.6085618945101},null,4.2,{"$f":"10^(G37)","v":15848.931924611146},{"$f":"0.01*H37/SQRT(J$3)","v":2.2413774476913004},0.47425612599223771,0.48823224399342124,0.49869843394473867,0.50735342400376504]
[9300,286.08720113908106,null,9300,121.02027066220501,null,4.3,19952.623149688792,2.8217270263209273,{"$f":"1.49*(1+3.77*I38)/(1+12.8*I38)","v":0.46717058393085392},0.47845871697944176,0.48695288245853141,0.49400374866789803]
[9400,275.52056029632001,null,9400,117.60840250376863,null,4.4000000000000004,25118.86431509586,3.5523438585818128,0.46147149807266508,0.47055836142784246,0.47742281979262896,0.48313841342580671]
[9500,265.55451510578132,null,9500,114.36155468939977,null,4.5,31622.77660168384,4.4721359549995858,0.4568990926288945,0.46419439186165112,0.4697227863817075,0.47433735494606022]
[9600,256.14548610843701,null,9600,111.26922124469539,null,4.5999999999999996,39810.717055349742,5.6300855987473488,0.45323802744537345,0.45908240560442776,0.46352246899296179,0.46723601074993065]
[9700,247.25367457023867,null,9700,108.32171072793712,null,4.7,50118.723362727294,7.0878578308394236,0.45031139621970595,0.45498535712784216,0.45854341671880033,0.46152404987797202]
[9800,238.84268464766726,null,9800,105.51007255906656,null,4.8,63095.734448019342,8.9230843384280245,0.44797488899892901,0.4517076752907524,0.4545538590018447,0.45694120841866892]
[9900,230.87918800567527,null,9900,102.82603091062511,null,4.9000000000000004,79432.823472428237,11.233497625229594,0.44611143797502895,0.44908928864015352,0.45136277907306965,0.45327171900948759]
[10000,223.33262561707608,null,10000,100.2619252965896,null,4.9999999999999902,99999.99999999789,14.142135623730653,0.44462648982746716,0.44700000000000006,0.44881396296115539,0.45033830986305806]
[10100,216.17494218635608,null,10100,97.810657103387939,null,5.0999999999999899,125892.54117941394,17.803893913754052,0.44344393946122357,{"$f":"1.49*(1+3.77*0.01*$H46/SQRT(K$3))/(1+12.8*0.01*$H46/SQRT(K$3))","v":0.44533443246979326},0.44678043407676565,0.44799636357442774]
[10200,209.38034925039003,null,10200,95.465641400980374,null,5.2,158489.31924611164,22.41377447691303,0.44250269795718894,0.44400762944120559,0.44515947511852494,0.44612855697235337]
[10300,202.92511352996021,null,10300,93.220763452907761,null,5.2999999999999901,199526.23149688353,28.217270263208651,0.4417538358528118,0.44295130810440803,0.44386830741494815,0.44464012669068831]
[10400,196.78736755298678,null,10400,91.07033941446123,null,5.3999999999999897,251188.64315095218,35.523438585817225,0.44115823005637667,0.44211072059435574,0.44284042007778496,0.4434547961567159]
[10500,190.94693995432544,null,10500,89.009080769149534,null,5.4999999999999902,316227.76601683145,44.721359549994872,0.44068464099419657,0.44144205575194356,0.44202249953632505,0.44251133727424247]
[10600,185.38520318744176,null,10600,87.032062106747787,null,5.5999999999999899,398107.17055348866,56.300855987472254,0.44030815093493347,0.44091030793978331,0.44137189102555668,0.44176070813342694]
[10700,180.08493666820397,null,10700,85.134691892498466,null,5.6999999999999904,501187.23362726188,70.878578308392662,0.44000890166389511,0.44048754113926197,0.44085451834070333,0.44116369511537473]
[10800,175.03020361718538,null,10800,83.31268591745534,null,5.7999999999999901,630957.3444801796,89.230843384278288,0.43977107789879333,0.4401514826314788,0.44044319064592385,0.44068898597067141]
[10900,170.20624007989659,null,10900,81.562043155308274,null,5.8999999999999897,794328.23472426354,112.33497625229327,0.43958209097724021,0.43988438845991379,0.44011623152391893,0.44031160475246001]
[11000,165.59935478905462,null,11000,79.879023781991975,null,6.8999999999999897,7943282.3472426441,1123.349762522934,0.43892466106964712,0.43895493651088807,0.43897816649143329,0.43899774947321485]
[11100,161.1968386933967,null,11100,78.260129141547097,null,7.8999999999999897,79432823.472426385,11233.497625229333,0.4388588728144987,0.43886190081612791,0.43886422427166855,0.43886618302731767]
[11200,156.98688311708383,null,11200,76.702083465573494,null,8.8999999999999897,794328234.72426474,112334.97625229345,0.43885229353602551,0.43885259634076418,0.43885282869089381,0.43885302457103437]
[11300,152.95850563533182,null,11300,75.201817174619919,null,9.8999999999999897,7943282347.2426567,1123349.7625229356,0.43885163560364832,0.43885166588416796,0.43885168911922667,0.43885170870728646]
[11400,149.10148285803385,null,11400,73.756451608368337,null,10.9,79432823472.428345,11233497.625229608,0.43885156981036533,0.43885157283841775,0.43885157516192408,0.43885157712073047]
[11500,145.40628940591139,null,11500,72.363285047807025,null,11.9,794328234724.2843,112334976.25229621,0.43885156323103652,0.43885156353384186,0.4388515637661925,0.43885156396207314]
[11600,141.86404244495807,null,11600,71.019779907027342,null,12.9,7943282347242.8525,1123349762.5229635,0.43885156257310365,0.43885156260338415,0.43885156262661928,0.43885156264620734]
[11700,138.46645121616632,null,11700,69.723550985056121,null,13.9,79432823472428.328,11233497625.229607,0.43885156250731033,0.43885156251033847,0.43885156251266194,0.43885156251462082]
[11800,135.20577106007531,null,11800,68.472354679461418,null,14.9,794328234724287,112334976252.29659,0.43885156250073099,0.43885156250103391,0.43885156250126622,0.43885156250146218]
[11900,132.07476149068515,null,11900,67.264079073516086,null,15.9,7943282347242850,1123349762522.9631,0.43885156250007301,0.43885156250010338,0.43885156250012675,0.43885156250014629]
[12000,129.06664792173157,null,12000,66.096734817633532,null,16.899999999999999,7.9432823472428304E+16,11233497625229.602,0.43885156250000734,0.43885156250001039,0.43885156250001267,0.43885156250001461]
[12100,126.17508669103671,null,12100,64.968446733731369,null,17.899999999999999,7.9432823472428109E+17,112334976252295.75,0.43885156250000068,{"$f":"1.49*(1+3.77*0.01*$H66/SQRT(K$3))/(1+12.8*0.01*$H66/SQRT(K$3))","v":0.43885156250000101},0.43885156250000129,0.43885156250000151]
[12200,123.39413306638866,null,12200,63.877446078254138,null,18.899999999999999,7.9432823472428483E+18,1123349762522962.7,0.43885156250000007,0.43885156250000007,0.43885156250000024,0.43885156250000024]
[12300,120.71821194976798,null,12300,62.8220634058952,null,19.899999999999999,7.9432823472428286E+19,1.12334976252296E+16,0.43885156250000001,0.43885156250000001,0.43885156250000013,0.43885156250000001]
[12400,{"$f":"8.32*EXP((3.29*10000)/A69)","v":118.14209102628735},null,{"$f":"+A69","v":12400},{"$f":"8.23*EXP((2.5*10000)/D69)","v":61.800721981691254},null,20.9,{"$f":"10^(G69)","v":7.9432823472428089E+20},{"$f":"0.01*H69/SQRT(J$3)","v":1.1233497625229573E+17},0.4388515624999999,0.4388515624999999,0.43885156250000001,0.43885156250000001]
[12500,115.66085613040678,null,12500,60.811931694199259,null,21.9,7.9432823472428469E+21,1.1233497625229626E+18,{"$f":"1.49*(1+3.77*I70)/(1+12.8*I70)","v":0.43885156250000001},0.43885156249999996,0.43885156250000007,0.43885156250000001]
[12600,113.26988862524378,null,12600,59.85428342697081,null,22.9,7.9432823472428262E+22,1.1233497625229597E+19,0.43885156250000001,0.43885156250000001,0.43885156250000001,0.43885156250000001]
[12700,110.96484461146801,null,12700,58.926443849578369,null,23.9,7.9432823472428071E+23,1.1233497625229569E+20,0.43885156249999996,0.43885156249999996,0.43885156250000001,0.43885156250000001]
[12800,108.7416358006661,null,12800,58.02715059306788,null,24.9,7.9432823472428441E+24,1.1233497625229623E+21,0.43885156250000001,0.43885156250000013,0.43885156250000013,0.43885156250000007]
[12900,106.59641190445174,null,12900,57.155207777964897]
[13000,104.52554440521737,null,13000,56.309481865883583]
[13100,102.52561158747932,null,13100,55.488897808418344]
[13200,100.59338472044122,null,13200,54.692435469366281]
[13300,98.725815292850356,null,13300,53.919126298464533]
[13400,96.920023210579544,null,13400,53.168050236754119]
[13500,95.173285875767718,null,13500,52.438332835422855]
[13600,93.483028073888335,null,13600,51.729142571554917]
[13700,91.846812601893646,null,13700,51.0396883456391]
[13800,90.262331576678491,null,13800,50.369217146979231]
[13900,88.727398368599339,null,13900,49.717011874320448]
[14000,87.239940109733439,null,14000,49.082389300067732]
[14100,85.797990731030382,null,14100,48.464698167437369]
[14200,84.399684486542938,null,14200,47.863317410760196]
[14300,83.043249926570624,null,14300,47.277654489952603]
[14400,81.727004284849841,null,14400,46.707143830898893]
[14500,80.449348247914628,null,14500,46.151245364150654]
[14600,79.208761077459087,null,14600,45.609443154952892]
[14700,78.003796058992762,null,14700,45.081244118158459]
[14800,76.833076252311074,null,14800,44.566176812095939]
[14900,75.695290521331628,null,14900,44.063790305916655]
[15000,74.589189822691665,null,15000,43.573653115368344]
[15100,73.513583734181964,null,15100,43.095352202328087]
[15200,72.467337205621462,null,15200,42.628492033781477]
[15300,71.449367516171904,null,15300,42.172693696258598]
[15400,70.45864142336471,null,15400,41.727594062034818]
[15500,69.494172490273712,null,15500,41.292845003678032]
[15600,{"$f":"8.32*EXP((3.29*10000)/A101)","v":68.555018578329225},null,{"$f":"+A101","v":15600},{"$f":"8.23*EXP((2.5*10000)/D101)","v":40.868112653774169}]
[15700,67.640279494240247,null,15700,40.453076706894109]
[15800,66.749094780379608,null,15800,40.04742976107714]
[15900,65.880641638801109,null,15900,39.65087669630163]
[16000,65.034132979802393,null,16000,39.263134087593372]
[16100,64.208815586632696,null,16100,38.883929650588669]
[16200,63.403968388570064,null,16200,38.513001717521355]
[16300,62.61890083517099,null,16300,38.150098741745346]
[16400,61.852951365023259,null,16400,37.794978829033781]
[16500,61.105485962820453,null,16500,37.447409294017291]
[16600,60.375896799024524,null,16600,37.107166240234747]
[16700,59.663600946795157,null,16700,36.774034162373496]
[16800,58.968039171244371,null,16800,36.447805569371326]
[16900,58.288674786425688,null,16900,36.128280627140967]
[17000,57.6249925757893,null,17000,35.815266819759842]
[17100,56.97649777213406,null,17100,35.508578628043928]
[17200,56.342715093361221,null,17200,35.208037224494902]
[17300,55.723187830590284,null,17300,34.913470183675564]
[17400,55.11747698543185,null,17400,34.624711207128762]
[17500,54.525160453430352,null,17500,34.34159986201233]
{"$rows_left_out":25}