{"text_format":"1","workbook":"xlsx","n_sheets":3,"sheets":["Tableau","Ephemeride","Donnees_Ephemerides"],"not_rendered":{"charts":0,"images":1,"macros":1,"external_links":0,"defined_names":3,"comments":2,"pivot_tables":0},"unopened":[],"bounds":{"document_bytes":16777216,"sheet_cells":100000,"rows_first":2000,"rows_last":500,"rows_between":2000,"halvings":0,"cell_chars":16384,"cell_head_chars":4096},"cells_cut":0,"cells_raw":0,"read":"whole","date_system":"1900"}

{"sheet":"Tableau","index":0,"n_rows":64,"n_cols":18,"rows_kept":64,"cut":false,"hidden":false,"merged":[[4,6,4,7],[0,1,0,14]]}
[{"$f":"+TODAY()","v":"2011-09-04"},"Ephémérides Miras",null,null,null,null,null,null,null,null,null,null,null,null,null,null,null,"F. Teyssier 08/2011"]
[{"$f":"+Ephemeride!F6","v":2455809.3702581022},56]
[]
[]
[null,"Id.","RA 2000","DE 2000","V Max.","V Min.","Type Spectral",null,"Période",null,"Phase","Mag.","Prochain",null,"Sources",null,"Phase Inf",0.2]
[null,null,null,null,null,null,"Maxi.","Min.",null,null,null,"Approx.","Maximum",null,null,null,"Phase Sup",0.1]
[]
[null,{"$f":"+Donnees_Ephemerides!R2","v":"W CET"},{"$f":"+Donnees_Ephemerides!T2","v":"0 2 7.38"},{"$f":"+Donnees_Ephemerides!U2","v":"-14 40 33"},{"$f":"+Donnees_Ephemerides!G2","v":7.6},{"$f":"+Donnees_Ephemerides!H2","v":14.4},{"$f":"+IF(Donnees_Ephemerides!I2<>0,Donnees_Ephemerides!I2,\"\")","v":"S7,3e"},{"$f":"+IF(Donnees_Ephemerides!J2<>0,Donnees_Ephemerides!J2,\"\")","v":"S9,2e"},{"$f":"+Donnees_Ephemerides!E2","v":351.31},null,{"$f":"phase(Donnees_Ephemerides!D2,I8,A$2)","v":0.21881033304543984},{"$f":"IF(K8<0,-(F8-E8)*K8*2+E8,(F8-E8)*K8*2+E8)","v":10.575820529417982},{"$f":"(INT(+(A$2-Donnees_Ephemerides!D2)/I8)+1)*I8+Donnees_Ephemerides!D2-Ephemeride!J$5","v":"2012-06-05T07:26:24"},null,{"$f":"+Donnees_Ephemerides!F2","v":"AAVSO"}]
[null,{"$f":"+Donnees_Ephemerides!R3","v":"T CAS"},{"$f":"+Donnees_Ephemerides!T3","v":"0 23 14.27"},{"$f":"+Donnees_Ephemerides!U3","v":"55 47 33.2"},{"$f":"+Donnees_Ephemerides!G3","v":7.9},{"$f":"+Donnees_Ephemerides!H3","v":11.9},{"$f":"+IF(Donnees_Ephemerides!I3<>0,Donnees_Ephemerides!I3,\"\")","v":"M7.5e"},{"$f":"+IF(Donnees_Ephemerides!J3<>0,Donnees_Ephemerides!J3,\"\")","v":"M9e"},{"$f":"+Donnees_Ephemerides!E3","v":444.83},null,{"$f":"phase(Donnees_Ephemerides!D3,I9,A$2)","v":0.30319505901623872},{"$f":"IF(K9<0,-(F9-E9)*K9*2+E9,(F9-E9)*K9*2+E9)","v":10.32556047212991},{"$f":"(INT(+(A$2-Donnees_Ephemerides!D3)/I9)+1)*I9+Donnees_Ephemerides!D3-Ephemeride!J$5","v":"2012-07-10T19:55:12"},null,{"$f":"+Donnees_Ephemerides!F3","v":"AAVSO"}]
[null,{"$f":"+Donnees_Ephemerides!R4","v":"R AND"},{"$f":"+Donnees_Ephemerides!T4","v":"0 24 1.94"},{"$f":"+Donnees_Ephemerides!U4","v":"38 34 37.3"},{"$f":"+Donnees_Ephemerides!G4","v":6.9},{"$f":"+Donnees_Ephemerides!H4","v":14.3},{"$f":"+IF(Donnees_Ephemerides!I4<>0,Donnees_Ephemerides!I4,\"\")","v":"S4,6e"},{"$f":"+IF(Donnees_Ephemerides!J4<>0,Donnees_Ephemerides!J4,\"\")","v":"S8,8e"},{"$f":"+Donnees_Ephemerides!E4","v":409.33},null,{"$f":"phase(Donnees_Ephemerides!D4,I10,A$2)","v":-0.1933152759333705},9.7610660838138834,{"$f":"(INT(+(A$2-Donnees_Ephemerides!D4)/I10)+1)*I10+Donnees_Ephemerides!D4-Ephemeride!J$5","v":"2011-11-23"},null,{"$f":"+Donnees_Ephemerides!F4","v":"AAVSO"}]
[null,{"$f":"+Donnees_Ephemerides!R5","v":"W AND"},{"$f":"+Donnees_Ephemerides!T5","v":"2 17 32.95"},{"$f":"+Donnees_Ephemerides!U5","v":"44 18 17.7"},{"$f":"+Donnees_Ephemerides!G5","v":7.4},{"$f":"+Donnees_Ephemerides!H5","v":13.7},{"$f":"+IF(Donnees_Ephemerides!I5<>0,Donnees_Ephemerides!I5,\"\")","v":"S7,1e"},{"$f":"+IF(Donnees_Ephemerides!J5<>0,Donnees_Ephemerides!J5,\"\")","v":""},{"$f":"+Donnees_Ephemerides!E5","v":395.93},null,{"$f":"phase(Donnees_Ephemerides!D5,I11,A$2)","v":-2.5584678851833687E-2},7.722366953533105,{"$f":"(INT(+(A$2-Donnees_Ephemerides!D5)/I11)+1)*I11+Donnees_Ephemerides!D5-Ephemeride!J$5","v":"2011-09-15"},null,{"$f":"+Donnees_Ephemerides!F5","v":"AAVSO"}]
[null,{"$f":"+Donnees_Ephemerides!R6","v":"OMI CET"},{"$f":"+Donnees_Ephemerides!T6","v":"2 19 20.78"},{"$f":"+Donnees_Ephemerides!U6","v":"-2 58 39.5"},{"$f":"+Donnees_Ephemerides!G6","v":3.4},{"$f":"+Donnees_Ephemerides!H6","v":9.3000000000000007},{"$f":"+IF(Donnees_Ephemerides!I6<>0,Donnees_Ephemerides!I6,\"\")","v":"M7e"},{"$f":"+IF(Donnees_Ephemerides!J6<>0,Donnees_Ephemerides!J6,\"\")","v":"M9e"},{"$f":"+Donnees_Ephemerides!E6","v":331.96},null,{"$f":"phase(Donnees_Ephemerides!D6,I12,A$2)","v":-3.653976954394067E-2},3.8311692806185,{"$f":"(INT(+(A$2-Donnees_Ephemerides!D6)/I12)+1)*I12+Donnees_Ephemerides!D6-Ephemeride!J$5","v":"2011-09-17"},null,{"$f":"+Donnees_Ephemerides!F6","v":"AAVSO"}]
[null,{"$f":"+Donnees_Ephemerides!R7","v":"U CET"},{"$f":"+Donnees_Ephemerides!T7","v":"2 33 43.66"},{"$f":"+Donnees_Ephemerides!U7","v":"-13 8 54.3"},{"$f":"+Donnees_Ephemerides!G7","v":7.5},{"$f":"+Donnees_Ephemerides!H7","v":12.6},{"$f":"+IF(Donnees_Ephemerides!I7<>0,Donnees_Ephemerides!I7,\"\")","v":"M5e"},{"$f":"+IF(Donnees_Ephemerides!J7<>0,Donnees_Ephemerides!J7,\"\")","v":"M6e"},{"$f":"+Donnees_Ephemerides!E7","v":234.76},null,{"$f":"phase(Donnees_Ephemerides!D7,I13,A$2)","v":0.2550275093806163},10.101280595682287,{"$f":"(INT(+(A$2-Donnees_Ephemerides!D7)/I13)+1)*I13+Donnees_Ephemerides!D7-Ephemeride!J$5","v":"2012-02-26T18:14:24"},null,{"$f":"+Donnees_Ephemerides!F7","v":"AAVSO"}]
[null,{"$f":"+Donnees_Ephemerides!R8","v":"R TRI"},{"$f":"+Donnees_Ephemerides!T8","v":"2 37 2.33"},{"$f":"+Donnees_Ephemerides!U8","v":"34 15 51.4"},{"$f":"+Donnees_Ephemerides!G8","v":6.2},{"$f":"+Donnees_Ephemerides!H8","v":11.7},{"$f":"+IF(Donnees_Ephemerides!I8<>0,Donnees_Ephemerides!I8,\"\")","v":"M5e"},{"$f":"+IF(Donnees_Ephemerides!J8<>0,Donnees_Ephemerides!J8,\"\")","v":"M8e"},{"$f":"+Donnees_Ephemerides!E8","v":266.89999999999998},null,{"$f":"phase(Donnees_Ephemerides!D8,I14,A$2)","v":-0.19119423715926009},8.3031366087518599,{"$f":"(INT(+(A$2-Donnees_Ephemerides!D8)/I14)+1)*I14+Donnees_Ephemerides!D8-Ephemeride!J$5","v":"2011-10-25T21:36:00"},null,{"$f":"+Donnees_Ephemerides!F8","v":"AAVSO"}]
[null,{"$f":"+Donnees_Ephemerides!R9","v":"T CAM"},{"$f":"+Donnees_Ephemerides!T9","v":"4 40 8.87"},{"$f":"+Donnees_Ephemerides!U9","v":"66 8 48.5"},{"$f":"+Donnees_Ephemerides!G9","v":8},{"$f":"+Donnees_Ephemerides!H9","v":13.8},{"$f":"+IF(Donnees_Ephemerides!I9<>0,Donnees_Ephemerides!I9,\"\")","v":""},{"$f":"+IF(Donnees_Ephemerides!J9<>0,Donnees_Ephemerides!J9,\"\")","v":""},{"$f":"+Donnees_Ephemerides!E9","v":373.2},null,{"$f":"phase(Donnees_Ephemerides!D9,I15,A$2)","v":3.9845278944784235E-2},8.4622052357594963,{"$f":"(INT(+(A$2-Donnees_Ephemerides!D9)/I15)+1)*I15+Donnees_Ephemerides!D9-Ephemeride!J$5","v":"2012-08-28T04:48:00"},null,{"$f":"+Donnees_Ephemerides!F9","v":"AAVSO"}]
[null,{"$f":"+Donnees_Ephemerides!R10","v":"R LEP"},{"$f":"+Donnees_Ephemerides!T10","v":"4 59 36.35"},{"$f":"+Donnees_Ephemerides!U10","v":"-14 48 22.5"},{"$f":"+Donnees_Ephemerides!G10","v":6.8},{"$f":"+Donnees_Ephemerides!H10","v":9.6},{"$f":"+IF(Donnees_Ephemerides!I10<>0,Donnees_Ephemerides!I10,\"\")","v":""},{"$f":"+IF(Donnees_Ephemerides!J10<>0,Donnees_Ephemerides!J10,\"\")","v":""},{"$f":"+Donnees_Ephemerides!E10","v":427.07},null,{"$f":"phase(Donnees_Ephemerides!D10,I16,A$2)","v":0.34390207249910665},8.7258516059949969,{"$f":"(INT(+(A$2-Donnees_Ephemerides!D10)/I16)+1)*I16+Donnees_Ephemerides!D10-Ephemeride!J$5","v":"2012-06-11T01:40:48"},null,{"$f":"+Donnees_Ephemerides!F10","v":"AAVSO"}]
[null,{"$f":"+Donnees_Ephemerides!R11","v":"R AUR"},{"$f":"+Donnees_Ephemerides!T11","v":"5 17 17.69"},{"$f":"+Donnees_Ephemerides!U11","v":"53 35 10.1"},{"$f":"+Donnees_Ephemerides!G11","v":7.7},{"$f":"+Donnees_Ephemerides!H11","v":13.3},{"$f":"+IF(Donnees_Ephemerides!I11<>0,Donnees_Ephemerides!I11,\"\")","v":""},{"$f":"+IF(Donnees_Ephemerides!J11<>0,Donnees_Ephemerides!J11,\"\")","v":""},{"$f":"+Donnees_Ephemerides!E11","v":457.51},null,{"$f":"phase(Donnees_Ephemerides!D11,I17,A$2)","v":-0.1030135776219242},8.8537520693655516,{"$f":"(INT(+(A$2-Donnees_Ephemerides!D11)/I17)+1)*I17+Donnees_Ephemerides!D11-Ephemeride!J$5","v":"2011-10-22"},null,{"$f":"+Donnees_Ephemerides!F11","v":"AAVSO"}]
[null,{"$f":"+Donnees_Ephemerides!R12","v":"U ORI"},{"$f":"+Donnees_Ephemerides!T12","v":"5 55 49.16"},{"$f":"+Donnees_Ephemerides!U12","v":"20 10 30.6"},{"$f":"+Donnees_Ephemerides!G12","v":6.3},{"$f":"+Donnees_Ephemerides!H12","v":12},{"$f":"+IF(Donnees_Ephemerides!I12<>0,Donnees_Ephemerides!I12,\"\")","v":""},{"$f":"+IF(Donnees_Ephemerides!J12<>0,Donnees_Ephemerides!J12,\"\")","v":""},{"$f":"+Donnees_Ephemerides!E12","v":368.3},null,{"$f":"phase(Donnees_Ephemerides!D12,I18,A$2)","v":0.48566456177625161},11.836576004249268,{"$f":"(INT(+(A$2-Donnees_Ephemerides!D12)/I18)+1)*I18+Donnees_Ephemerides!D12-Ephemeride!J$5","v":"2012-03-12T07:12:00"},null,{"$f":"+Donnees_Ephemerides!F12","v":"AAVSO"}]
[null,{"$f":"+Donnees_Ephemerides!R13","v":"V MON"},{"$f":"+Donnees_Ephemerides!T13","v":"6 22 43.57"},{"$f":"+Donnees_Ephemerides!U13","v":"-2 11 43.5"},{"$f":"+Donnees_Ephemerides!G13","v":7},{"$f":"+Donnees_Ephemerides!H13","v":13.1},{"$f":"+IF(Donnees_Ephemerides!I13<>0,Donnees_Ephemerides!I13,\"\")","v":""},{"$f":"+IF(Donnees_Ephemerides!J13<>0,Donnees_Ephemerides!J13,\"\")","v":""},{"$f":"+Donnees_Ephemerides!E13","v":340.5},null,{"$f":"phase(Donnees_Ephemerides!D13,I19,A$2)","v":-0.46587295711543764},12.683650076808338,{"$f":"(INT(+(A$2-Donnees_Ephemerides!D13)/I19)+1)*I19+Donnees_Ephemerides!D13-Ephemeride!J$5","v":"2012-02-10T12:00:00"},null,{"$f":"+Donnees_Ephemerides!F13","v":"AAVSO"}]
[null,{"$f":"+Donnees_Ephemerides!R14","v":"X MON"},{"$f":"+Donnees_Ephemerides!T14","v":"6 57 11.81"},{"$f":"+Donnees_Ephemerides!U14","v":"-9 3 52"},{"$f":"+Donnees_Ephemerides!G14","v":7.4},{"$f":"+Donnees_Ephemerides!H14","v":9.1},{"$f":"+IF(Donnees_Ephemerides!I14<>0,Donnees_Ephemerides!I14,\"\")","v":""},{"$f":"+IF(Donnees_Ephemerides!J14<>0,Donnees_Ephemerides!J14,\"\")","v":""},{"$f":"+Donnees_Ephemerides!E14","v":155.80000000000001},null,{"$f":"phase(Donnees_Ephemerides!D14,I20,A$2)","v":-0.28838088509503557},8.3804950093231216,{"$f":"(INT(+(A$2-Donnees_Ephemerides!D14)/I20)+1)*I20+Donnees_Ephemerides!D14-Ephemeride!J$5","v":"2011-10-19T19:12:00"},null,{"$f":"+Donnees_Ephemerides!F14","v":"AAVSO"}]
[null,{"$f":"+Donnees_Ephemerides!R15","v":"R LYN"},{"$f":"+Donnees_Ephemerides!T15","v":"7 1 18"},{"$f":"+Donnees_Ephemerides!U15","v":"55 19 49.8"},{"$f":"+Donnees_Ephemerides!G15","v":7.9},{"$f":"+Donnees_Ephemerides!H15","v":13.8},{"$f":"+IF(Donnees_Ephemerides!I15<>0,Donnees_Ephemerides!I15,\"\")","v":""},{"$f":"+IF(Donnees_Ephemerides!J15<>0,Donnees_Ephemerides!J15,\"\")","v":""},{"$f":"+Donnees_Ephemerides!E15","v":378.75},null,{"$f":"phase(Donnees_Ephemerides!D15,I21,A$2)","v":0.19503698508829961},10.201436424041937,{"$f":"(INT(+(A$2-Donnees_Ephemerides!D15)/I21)+1)*I21+Donnees_Ephemerides!D15-Ephemeride!J$5","v":"2012-07-05T18:00:00"},null,{"$f":"+Donnees_Ephemerides!F15","v":"AAVSO"}]
[null,{"$f":"+Donnees_Ephemerides!R16","v":"S CMI"},{"$f":"+Donnees_Ephemerides!T16","v":"7 32 43.07"},{"$f":"+Donnees_Ephemerides!U16","v":"8 19 5.1"},{"$f":"+Donnees_Ephemerides!G16","v":7.5},{"$f":"+Donnees_Ephemerides!H16","v":12.6},{"$f":"+IF(Donnees_Ephemerides!I16<>0,Donnees_Ephemerides!I16,\"\")","v":""},{"$f":"+IF(Donnees_Ephemerides!J16<>0,Donnees_Ephemerides!J16,\"\")","v":""},{"$f":"+Donnees_Ephemerides!E16","v":332.94},null,{"$f":"phase(Donnees_Ephemerides!D16,I22,A$2)","v":-0.10551373189705815},8.5762400653499924,{"$f":"(INT(+(A$2-Donnees_Ephemerides!D16)/I22)+1)*I22+Donnees_Ephemerides!D16-Ephemeride!J$5","v":"2011-10-10"},null,{"$f":"+Donnees_Ephemerides!F16","v":"AAVSO"}]
[null,{"$f":"+Donnees_Ephemerides!R17","v":"R GEM"},{"$f":"+Donnees_Ephemerides!T17","v":"7 7 21.27"},{"$f":"+Donnees_Ephemerides!U17","v":"22 42 12.7"},{"$f":"+Donnees_Ephemerides!G17","v":7.1},{"$f":"+Donnees_Ephemerides!H17","v":13.5},{"$f":"+IF(Donnees_Ephemerides!I17<>0,Donnees_Ephemerides!I17,\"\")","v":""},{"$f":"+IF(Donnees_Ephemerides!J17<>0,Donnees_Ephemerides!J17,\"\")","v":""},{"$f":"+Donnees_Ephemerides!E17","v":369.91},null,{"$f":"phase(Donnees_Ephemerides!D17,I23,A$2)","v":-0.34073083154769146},11.46135464381045,{"$f":"(INT(+(A$2-Donnees_Ephemerides!D17)/I23)+1)*I23+Donnees_Ephemerides!D17-Ephemeride!J$5","v":"2012-01-08T21:50:24"},null,{"$f":"+Donnees_Ephemerides!F17","v":"AAVSO"}]
[null,{"$f":"+Donnees_Ephemerides!R18","v":"R CMI"},{"$f":"+Donnees_Ephemerides!T18","v":"7 8 42.6"},{"$f":"+Donnees_Ephemerides!U18","v":"10 1 26.5"},{"$f":"+Donnees_Ephemerides!G18","v":8},{"$f":"+Donnees_Ephemerides!H18","v":11},{"$f":"+IF(Donnees_Ephemerides!I18<>0,Donnees_Ephemerides!I18,\"\")","v":""},{"$f":"+IF(Donnees_Ephemerides!J18<>0,Donnees_Ephemerides!J18,\"\")","v":""},{"$f":"+Donnees_Ephemerides!E18","v":337.78},null,{"$f":"phase(Donnees_Ephemerides!D18,I24,A$2)","v":-6.8475759067459618E-2},8.4108545544047573,{"$f":"(INT(+(A$2-Donnees_Ephemerides!D18)/I24)+1)*I24+Donnees_Ephemerides!D18-Ephemeride!J$5","v":"2011-09-28"},null,{"$f":"+Donnees_Ephemerides!F18","v":"AAVSO"}]
[null,{"$f":"+Donnees_Ephemerides!R19","v":"R CNC"},{"$f":"+Donnees_Ephemerides!T19","v":"8 16 33.82"},{"$f":"+Donnees_Ephemerides!U19","v":"11 43 34.5"},{"$f":"+Donnees_Ephemerides!G19","v":6.8},{"$f":"+Donnees_Ephemerides!H19","v":11.2},{"$f":"+IF(Donnees_Ephemerides!I19<>0,Donnees_Ephemerides!I19,\"\")","v":"M6.5e"},{"$f":"+IF(Donnees_Ephemerides!J19<>0,Donnees_Ephemerides!J19,\"\")","v":"M9e"},{"$f":"+Donnees_Ephemerides!E19","v":361.6},null,{"$f":"phase(Donnees_Ephemerides!D19,I25,A$2)","v":6.3247395194119121E-2},7.3565770777082484,{"$f":"(INT(+(A$2-Donnees_Ephemerides!D19)/I25)+1)*I25+Donnees_Ephemerides!D19-Ephemeride!J$5","v":"2012-08-08T14:24:00"},null,{"$f":"+Donnees_Ephemerides!F19","v":"AAVSO"}]
[null,{"$f":"+Donnees_Ephemerides!R20","v":"V CNC"},{"$f":"+Donnees_Ephemerides!T20","v":"8 21 42.85"},{"$f":"+Donnees_Ephemerides!U20","v":"17 17 6.7"},{"$f":"+Donnees_Ephemerides!G20","v":7.9},{"$f":"+Donnees_Ephemerides!H20","v":12.8},{"$f":"+IF(Donnees_Ephemerides!I20<>0,Donnees_Ephemerides!I20,\"\")","v":"S1,9e"},{"$f":"+IF(Donnees_Ephemerides!J20<>0,Donnees_Ephemerides!J20,\"\")","v":""},{"$f":"+Donnees_Ephemerides!E20","v":272.13},null,{"$f":"phase(Donnees_Ephemerides!D20,I26,A$2)","v":0.25307852167050116},10.380169512370912,{"$f":"(INT(+(A$2-Donnees_Ephemerides!D20)/I26)+1)*I26+Donnees_Ephemerides!D20-Ephemeride!J$5","v":"2012-03-26T03:07:12"},null,{"$f":"+Donnees_Ephemerides!F20","v":"AAVSO"}]
[null,{"$f":"+Donnees_Ephemerides!R21","v":"S HYA"},{"$f":"+Donnees_Ephemerides!T21","v":"8 53 33.95"},{"$f":"+Donnees_Ephemerides!U21","v":"3 4 6.4"},{"$f":"+Donnees_Ephemerides!G21","v":7.8},{"$f":"+Donnees_Ephemerides!H21","v":12.7},{"$f":"+IF(Donnees_Ephemerides!I21<>0,Donnees_Ephemerides!I21,\"\")","v":""},{"$f":"+IF(Donnees_Ephemerides!J21<>0,Donnees_Ephemerides!J21,\"\")","v":""},{"$f":"+Donnees_Ephemerides!E21","v":256.63},null,{"$f":"phase(Donnees_Ephemerides!D21,I27,A$2)","v":4.235770604447444E-2},8.2151055192358484,{"$f":"(INT(+(A$2-Donnees_Ephemerides!D21)/I27)+1)*I27+Donnees_Ephemerides!D21-Ephemeride!J$5","v":"2012-05-07T15:07:12"},null,{"$f":"+Donnees_Ephemerides!F21","v":"AAVSO"}]
[null,{"$f":"+Donnees_Ephemerides!R22","v":"T HYA"},{"$f":"+Donnees_Ephemerides!T22","v":"8 55 39.83"},{"$f":"+Donnees_Ephemerides!U22","v":"-9 8 29.2"},{"$f":"+Donnees_Ephemerides!G22","v":7.8},{"$f":"+Donnees_Ephemerides!H22","v":12.6},{"$f":"+IF(Donnees_Ephemerides!I22<>0,Donnees_Ephemerides!I22,\"\")","v":""},{"$f":"+IF(Donnees_Ephemerides!J22<>0,Donnees_Ephemerides!J22,\"\")","v":""},{"$f":"+Donnees_Ephemerides!E22","v":289.2},null,{"$f":"phase(Donnees_Ephemerides!D22,I28,A$2)","v":-3.9064380975328827E-3},7.8375018057363155,{"$f":"(INT(+(A$2-Donnees_Ephemerides!D22)/I28)+1)*I28+Donnees_Ephemerides!D22-Ephemeride!J$5","v":"2011-09-06"},null,{"$f":"+Donnees_Ephemerides!F22","v":"AAVSO"}]
[null,{"$f":"+Donnees_Ephemerides!R23","v":"R LMI"},{"$f":"+Donnees_Ephemerides!T23","v":"9 45 34.27"},{"$f":"+Donnees_Ephemerides!U23","v":"34 30 42.8"},{"$f":"+Donnees_Ephemerides!G23","v":7.1},{"$f":"+Donnees_Ephemerides!H23","v":12.6},{"$f":"+IF(Donnees_Ephemerides!I23<>0,Donnees_Ephemerides!I23,\"\")","v":""},{"$f":"+IF(Donnees_Ephemerides!J23<>0,Donnees_Ephemerides!J23,\"\")","v":""},{"$f":"+Donnees_Ephemerides!E23","v":372.19},null,{"$f":"phase(Donnees_Ephemerides!D23,I29,A$2)","v":-0.42806024314948421},11.808662674644326,{"$f":"(INT(+(A$2-Donnees_Ephemerides!D23)/I29)+1)*I29+Donnees_Ephemerides!D23-Ephemeride!J$5","v":"2012-02-11T04:33:36"},null,{"$f":"+Donnees_Ephemerides!F23","v":"AAVSO"}]
[null,{"$f":"+Donnees_Ephemerides!R24","v":"R LEO"},{"$f":"+Donnees_Ephemerides!T24","v":"9 47 33.48"},{"$f":"+Donnees_Ephemerides!U24","v":"11 25 43.7"},{"$f":"+Donnees_Ephemerides!G24","v":5.8},{"$f":"+Donnees_Ephemerides!H24","v":10},{"$f":"+IF(Donnees_Ephemerides!I24<>0,Donnees_Ephemerides!I24,\"\")","v":"M7e"},{"$f":"+IF(Donnees_Ephemerides!J24<>0,Donnees_Ephemerides!J24,\"\")","v":"M9e"},{"$f":"+Donnees_Ephemerides!E24","v":309.95},null,{"$f":"phase(Donnees_Ephemerides!D24,I30,A$2)","v":0.33834572705982729},8.6421041073025489,{"$f":"(INT(+(A$2-Donnees_Ephemerides!D24)/I30)+1)*I30+Donnees_Ephemerides!D24-Ephemeride!J$5","v":"2012-03-27T22:48:00"},null,{"$f":"+Donnees_Ephemerides!F24","v":"AAVSO"}]
{"$rows_left_out":35}
{"sheet":"Ephemeride","index":1,"n_rows":22,"n_cols":12,"rows_kept":22,"cut":false,"hidden":false,"merged":[]}
[]
[null,"Calcul Ephémérides Miras"]
[]
[null,null,null,null,null,"Heure d'été",null,null,true,{"$f":"+IF(I4=TRUE,1,0)","v":1}]
[null,null,null,null,"Date",{"$f":"NOW()","v":"2011-09-04T22:53:10.300"},null,null,null,2415018.5]
[null,"Nom",{"$f":"+VLOOKUP(Donnees_Ephemerides!$H$1,Donnees_Ephemerides!$A$2:$J$60,3)","v":"R TRI"},null,"JD",{"$f":"+F5+J5-1/24-J4/24","v":2455809.3702581022}]
[]
[null,"JD0",{"$f":"+VLOOKUP(Donnees_Ephemerides!$H$1,Donnees_Ephemerides!$A$2:$J$60,4)","v":2455593.5},null,"Date calcul","Jour",null,null,3]
[]
[null,"E",{"$f":"+VLOOKUP(Donnees_Ephemerides!$H$1,Donnees_Ephemerides!$A$2:$J$60,5)","v":266.89999999999998},null,null,"Mois",null,null,9]
[]
[null,"Type",{"$f":"+VLOOKUP(Donnees_Ephemerides!$H$1,Donnees_Ephemerides!$A$2:$J$60,3)","v":"R TRI"},null,null,"Année",null,null,2]
[null,null,null,null,null,null,null,null,{"$f":"+DATE(I12+2009,I10,I8)","v":"2011-09-03"}]
[null,"Date",{"$f":"+IF(I14=TRUE,I13,F5)","v":"2011-09-03"},null,"UT","Heures",23,null,true]
[null,"Cycle",{"$f":"INT((G19-C8)/C10)+1","v":1},null,null,"Minutes",28]
[null,"Phase",{"$f":"phase(C8,C10,G19)","v":-0.19453811248518038},null,null,null,{"$f":"(+G14+G15/60)/24","v":0.97777777777777775},null,{"$f":"+I13+J5+G16","v":2455808.4777777777},null,null,{"$f":"+G15","v":28}]
[null,null,{"$f":"IF(C16<0,C16+1,\"\")","v":0.80546188751481962}]
[]
[null,"Prochain maximum",{"$f":"C15*C10+C8-J5","v":"2011-10-25T21:36:00"},null,"JD",null,{"$f":"+I19","v":2455808.4777777777},null,{"$f":"+IF(I14=TRUE,I16,F6)","v":2455808.4777777777}]
[]
[]
[null,"Source",{"$f":"+VLOOKUP(Donnees_Ephemerides!$H$1,Donnees_Ephemerides!$A$2:$H$28,6)","v":"AAVSO"},null,null,null,null,null,{"$f":"JD(C14)","v":2455807.5}]

{"sheet":"Donnees_Ephemerides","index":2,"n_rows":58,"n_cols":29,"rows_kept":58,"cut":false,"hidden":false,"merged":[]}
["#","ccc","nom","JD0","E","Source","V Max",7,"Sp Max","Sp Min",1,"Janvier",2010,null,"00","00",null,"#id","Const","RA","DE","Min","Max","Delta mag","Période","Date Max"]
[1,{"$f":"+S2","v":"CET"},{"$f":"+R2","v":"W CET"},{"$f":"+JD(Z2)","v":2455732.5},{"$f":"+Y2","v":351.31},"AAVSO",{"$f":"+V2","v":7.6},{"$f":"+W2","v":14.4},{"$f":"+AB2","v":"S7,3e"},{"$f":"+AC2","v":"S9,2e"},2,"Février",2011,null,"01","01",null,"W CET","CET","0 2 7.38","-14 40 33",7.6,14.4,6.8000000000000007,351.31,"2011-06-20",0,"S7,3e","S9,2e"]
[2,{"$f":"+S3","v":"CAS"},{"$f":"+R3","v":"T CAS"},{"$f":"+JD(Z3)","v":2455674.5},{"$f":"+Y3","v":444.83},"AAVSO",{"$f":"+V3","v":7.9},{"$f":"+W3","v":11.9},{"$f":"+AB3","v":"M7.5e"},{"$f":"+AC3","v":"M9e"},3,"Mars",2012,null,"02","02",null,"T CAS","CAS","0 23 14.27","55 47 33.2",7.9,11.9,4,444.83,"2011-04-23",0,"M7.5e","M9e"]
[3,"AND","R AND",2455888.5,409.33,"AAVSO",6.9,14.3,"S4,6e","S8,8e",4,"Avril",2013,null,"03","03",null,"R AND","AND","0 24 1.94","38 34 37.3",6.9,14.3,7.4,409.33,"2011-11-23",0,"S4,6e","S8,8e"]
[4,"AND","W AND",2455819.5,395.93,"AAVSO",7.4,13.7,"S7,1e",0,5,"Mai",2014,null,"04","04",null,"W AND","AND","2 17 32.95","44 18 17.7",7.4,13.7,6.2999999999999989,395.93,"2011-09-15",2,"S7,1e"]
[5,"CET","OMI CET",2455821.5,331.96,"AAVSO",3.4,9.3000000000000007,{"$f":"+AB6","v":"M7e"},{"$f":"+AC6","v":"M9e"},6,"Juin",2015,null,"05","05",null,"OMI CET","CET","2 19 20.78","-2 58 39.5",3.4,9.3000000000000007,5.9,331.96,"2011-09-17",2,"M7e","M9e"]
[6,"CET","U CET",2455749.5,234.76,"AAVSO",7.5,12.6,"M5e","M6e",7,"Juillet",2016,null,"06","06",null,"U CET","CET","2 33 43.66","-13 8 54.3",7.5,12.6,5.0999999999999996,234.76,"2011-07-07",2,"M5e","M6e"]
[7,"TRI","R TRI",2455593.5,266.89999999999998,"AAVSO",6.2,11.7,"M5e","M8e",8,"Août",2017,null,"07","07",null,"R TRI","TRI","2 37 2.33","34 15 51.4",6.2,11.7,5.4999999999999991,266.89999999999998,"2011-02-01",2,"M5e","M8e"]
[8,"CAM","T CAM",2455794.5,373.2,"AAVSO",8,13.8,0,0,9,"Septembre",2018,null,"08","08",null,"T CAM","CAM","4 40 8.87","66 8 48.5",8,13.8,5.8000000000000007,373.2,"2011-08-21",4]
[9,"LEP","R LEP",2455662.5,427.07,"AAVSO",6.8,9.6,0,0,10,"Octobre",2019,null,"09","09",null,"R LEP","LEP","4 59 36.35","-14 48 22.5",6.8,9.6,2.8,427.07,"2011-04-11",4]
[10,"AUR","R AUR",2455856.5,457.51,"AAVSO",7.7,13.3,0,0,11,"Novembre",2020,null,10,10,null,"R AUR","AUR","5 17 17.69","53 35 10.1",7.7,13.3,5.6000000000000005,457.51,"2011-10-22",5]
[11,"ORI","U ORI",2455630.5,368.3,"AAVSO",6.3,12,0,0,12,"Décembre",null,null,11,11,null,"U ORI","ORI","5 55 49.16","20 10 30.6",6.3,12,5.7,368.3,"2011-03-10",5]
[12,"MON","V MON",2455627.5,340.5,"AAVSO",7,13.1,0,0,13,null,null,null,12,12,null,"V MON","MON","6 22 43.57","-2 11 43.5",7,13.1,6.1,340.5,"2011-03-07",6]
[13,"MON","X MON",2455698.5,155.80000000000001,"AAVSO",7.4,9.1,0,0,14,null,null,null,13,13,null,"X MON","MON","6 57 11.81","-9 3 52",7.4,9.1,1.6999999999999993,155.80000000000001,"2011-05-17",6]
[14,"LYN","R LYN",2455735.5,378.75,"AAVSO",7.9,13.8,0,0,15,null,null,null,14,14,null,"R LYN","LYN","7 1 18","55 19 49.8",7.9,13.8,5.9,378.75,"2011-06-23",7]
[15,"CMI","S CMI",2455844.5,332.94,"AAVSO",7.5,12.6,{"$f":"+AB16","v":0},{"$f":"+AC16","v":0},16,null,null,null,15,15,null,"S CMI","CMI","7 32 43.07","8 19 5.1",7.5,12.6,5.0999999999999996,332.94,"2011-10-10",7]
[16,"GEM","R GEM",2455565.5,369.91,"AAVSO",7.1,13.5,0,0,17,null,null,null,16,16,null,"R GEM","GEM","7 7 21.27","22 42 12.7",7.1,13.5,6.4,369.91,"2011-01-04",7]
[17,"CMI","R CMI",2455832.5,337.78,"AAVSO",8,11,0,0,18,null,null,null,17,17,null,"R CMI","CMI","7 8 42.6","10 1 26.5",8,11,3,337.78,"2011-09-28",7]
[18,"CNC","R CNC",2455786.5,361.6,"AAVSO",6.8,11.2,"M6.5e","M9e",19,null,null,null,18,18,null,"R CNC","CNC","8 16 33.82","11 43 34.5",6.8,11.2,4.3999999999999995,361.6,"2011-08-13",8,"M6.5e","M9e"]
[19,"CNC","V CNC",2455740.5,272.13,"AAVSO",7.9,12.8,"S1,9e",0,20,null,null,null,19,19,null,"V CNC","CNC","8 21 42.85","17 17 6.7",7.9,12.8,4.9000000000000004,272.13,"2011-06-28",8,"S1,9e"]
[20,"HYA","S HYA",2455798.5,256.63,"AAVSO",7.8,12.7,0,0,21,null,null,null,21,21,null,"S HYA","HYA","8 53 33.95","3 4 6.4",7.8,12.7,4.8999999999999995,256.63,"2011-08-25",8]
[21,"HYA","T HYA",2455810.5,289.2,"AAVSO",7.8,12.6,0,0,22,null,null,null,22,22,null,"T HYA","HYA","8 55 39.83","-9 8 29.2",7.8,12.6,4.8,289.2,"2011-09-06",8]
[22,"LMI","R LMI",2455596.5,372.19,"AAVSO",7.1,12.6,0,0,23,null,null,null,23,23,null,"R LMI","LMI","9 45 34.27","34 30 42.8",7.1,12.6,5.5,372.19,"2011-02-04",9]
[23,"LEO","R LEO",2455704.5,309.95,"AAVSO",5.8,10,"M7e","M9e",24,null,null,null,null,24,null,"R LEO","LEO","9 47 33.48","11 25 43.7",5.8,10,4.2,309.95,"2011-05-23",9,"M7e","M9e"]
[24,"UMA","R UMA",2455808.5,301.62,"AAVSO",7.5,13,0,0,25,null,null,null,null,25,null,"R UMA","UMA","10 44 38.46","68 46 32.7",7.5,13,5.5,301.62,"2011-09-04",10]
[25,"VIR","SS VIR",2455741.5,364.14,"AAVSO",6.8,8.9,0,0,26,null,null,null,null,26,null,"SS VIR","VIR","12 25 14.4","0 46 10.9",6.8,8.9,2.1000000000000005,364.14,"2011-06-29",12]
[26,"UMA","T UMA",2455856.5,256.60000000000002,"AAVSO",7.7,12.9,0,0,27,null,null,null,null,27,null,"T UMA","UMA","12 36 23.46","59 29 12.9",7.7,12.9,5.2,256.60000000000002,"2011-10-22",12]
[27,"VIR","R VIR",2455617.5,145.63,"AAVSO",6.9,11.5,0,0,28,null,null,null,null,28,null,"R VIR","VIR","12 38 29.94","6 59 18.9",6.9,11.5,4.5999999999999996,145.63,"2011-02-25",12]
[28,"UMA","S UMA",2455700.5,225.87,"AAVSO",7.8,11.7,0,0,29,null,null,null,null,29,null,"S UMA","UMA","12 43 56.67","61 5 35.4",7.8,11.7,3.8999999999999995,225.87,"2011-05-19",12]
[29,"CVN","V CVN",2455702.5,191.89,"AAVSO",6.8,8.8000000000000007,0,0,30,null,null,null,null,30,null,"V CVN","CVN","13 19 27.77","45 31 37.7",6.8,8.8000000000000007,2.0000000000000009,191.89,"2011-05-21",13]
{"$rows_left_out":28}