{"text_format":"1","workbook":"xlsx","n_sheets":6,"sheets":["Index","Base","Carte","Extraction","Data","Simbad"],"not_rendered":{"charts":3,"images":3,"macros":1,"external_links":0,"defined_names":1,"comments":0,"pivot_tables":0},"unopened":[{"sheet":"Carte","index":2,"reason":"not_a_worksheet"}],"bounds":{"document_bytes":16777216,"sheet_cells":100000,"rows_first":2000,"rows_last":500,"rows_between":2000,"halvings":0,"cell_chars":16384,"cell_head_chars":4096},"cells_cut":0,"cells_raw":0,"read":"whole","date_system":"1900"}

{"sheet":"Index","index":0,"n_rows":32,"n_cols":14,"rows_kept":32,"cut":false,"hidden":false,"merged":[]}
[]
[]
[null,"Champ",{"$f":"+A14","v":10},"°",null,null,null,null,null,null,"Catalogue d'étoiles B de luminosité III IV V"]
[]
[null,"AD",{"$f":"+A16*C3/2","v":280},"°",null,null,null,null,null,null,"Extrait de Simbad "]
[null,null,{"$f":"+C5/15","v":18.666666666666668},"h",null,null,"Nb Stars",{"$f":"+COUNTA(G11:G400)","v":22},null,null,"Mag V < 10"]
[]
[null,"De",35,"°"]
[null,null,null,null,null,null,"Name","Type","Be - Em.","RA","DE","V","B","Sp Type"]
[null,"Type -",2]
[null,"Type +",3,null,null,null,"HR 6968"," *i*"," ","18 32 49.9","+30 33 15.15",5.3890000000000002,5.4649999999999999,"B8IV           "]
[null,null,null,null,null,null,"HR 6971"," Be*"," Be","18 33 23","+30 53 31.52",6.4370000000000003,6.5380000000000003,"B4Ve           "]
[null,null,null,null,null,null,"HR 6984"," *  "," ","18 35 13.5","+34 27 28.87",5.984,6.0880000000000001,"B5Vne           "]
[10,"Champ",null,null,null,null,"HR 6984"," *  "," ","18 35 13.5","+34 27 28.87",5.984,6.0880000000000001,"B5Vne           "]
[null,null,null,null,null,null,"HR 6997"," *  "," ","18 36 37.3","+33 28 8.54",5.3120000000000003,5.41,"B8II-IIIp...   "]
[56,"AD",null,null,null,null,"HR 7030"," *  "," ","18 41 41.3","+31 37 3.4",6.3559999999999999,6.4029999999999996,"B8V            "]
[null,null,null,null,null,null,"HR 7033"," *  "," ","18 42 8","+34 44 46.69",6.34,6.47,"B5V             "]
[8,"DE",null,null,null,null,"HR 7033"," *  "," ","18 42 8","+34 44 46.69",6.34,6.47,"B5V             "]
[null,null,null,null,null,null,"HR 7081"," Be*"," Be","18 47 57.3","+31 45 24.6",5.9119999999999999,6.0469999999999997,"B3IVp          "]
[null,null,null,null,null,null,"8 Lyr"," V* "," ","18 49 45.9","+32 48 46.16",5.7629999999999999,5.9139999999999997,"B3IV           "]
[null,null,null,null,null,null,"bet Lyr","Var bL*"," ","18 50 4.7","+33 21 45.6",3.52,3.52,"B8II-IIIep     "]
[null,null,null,null,null,null,"HD 174664"," SB*"," ","18 50 6.7","+33 21 6.67",7.05,7.13,"B5V             "]
[null,null,null,null,null,null,"HD 174664"," SB*"," ","18 50 6.7","+33 21 6.67",7.05,7.13,"B5V             "]
[null,null,null,null,null,null,"HR 7115"," *  "," ","18 51 36.5","+36 32 20.72",5.9930000000000003,6.09,"B6IV           "]
[null,5,null,null,null,null,"HD 175081"," *i*"," ","18 52 1.5","+37 30 59.49",7.27,7.34,"B5n             "]
[null,10,null,null,null,null,"HD 175081"," *i*"," ","18 52 1.5","+37 30 59.49",7.27,7.34,"B5n             "]
[null,null,null,null,null,null,"11 Lyr"," *  "," ","18 53 43.5","+36 58 18.19",5.4329999999999998,5.569,"B2.5V          "]
[null,null,null,null,null,null,"HD 175885"," *i*"," ","18 56 1.6","+33 47 8.12",8.11,8.1300000000000008,"B9V            "]
[null,null,null,null,null,null,"V542 Lyr","Var Al*"," ","18 58 1.8","+38 15 58.28",5.798,5.8860000000000001,"B7IV           "]
[null,null,null,null,null,null,"SULAFAT"," *i*"," ","18 58 56.6","+32 41 22.4",3.2,3.25,"B9III          "]
[null,null,null,null,null,null,"V545 Lyr","Var LP*"," ","18 59 12.2","+39 13 2.36",6.2489999999999997,6.4039999999999999,"B5IV            "]
[null,null,null,null,null,null,"V545 Lyr","Var LP*"," ","18 59 12.2","+39 13 2.36",6.2489999999999997,6.4039999999999999,"B5IV            "]

{"sheet":"Base","index":1,"n_rows":2691,"n_cols":19,"rows_kept":2691,"cut":false,"hidden":false,"merged":[]}
["Name","Var","Type","Em","Be","AD0","AD","DE0","DE","B mag","V Mag","Sp Type","Sp Simp","Luminosity"]
["BD+61 2579","","*  ",null,"",0.1048192,"0 0 25.1",62.725581400000003,"+62 43 32.09",10.029999999999999,9.84,"B8V            ",{"$f":"+LEFT(L2,2)","v":"B8"},{"$f":"+IF(MID(L2,3,1)=\".\",MID(L2,5,10),MID(L2,3,10))","v":"V         "},{"$f":"+F2","v":0.1048192},{"$f":"+H2","v":62.725581400000003},{"$f":"11-K2","v":1.1600000000000001}]
["CG And","Var","a2*",null,"",0.18180992000000001,"0 0 43.6",45.253332980000003,"+45 15 11.99",6.3049999999999997,6.3529999999999998,"B9p...         ","B9","p...      ",{"$f":"+F3","v":0.18180992000000001},{"$f":"+H3","v":45.253332980000003},4.6470000000000002]
["BD+60 2654","","*  ",null,"",0.19874539999999999,"0 0 47.6",60.8138231,"+60 48 49.76",10.08,9.9,"B8III          ","B8","III       ",0.19874539999999999,60.8138231,1.0999999999999996]
["BD+61 2581","","*  ","","",0.24595210000000001,"0 0 59",62.081434199999997,"+62 4 53.16",10.16,9.91,"B3V            ","B3","V         ",0.24595210000000001,62.081434199999997,1.0899999999999999]
["BD+62 2345","","*  ","","",0.31536700000000001,"0 1 15.6",63.2425,"+63 14 32.99",10.01,9.8699999999999992,"B2V            ","B2","V         ",0.31536700000000001,63.2425,1.1300000000000008]
["BD+62 2346","","Be*","","Be",0.35289599999999999,"0 1 24.6",63.504368999999997,"+63 30 15.72",10.106999999999999,9.73,"B0V            ","B0","V         ",0.35289599999999999,63.504368999999997,1.2699999999999996]
["HD 224905                ",{"$f":"IF(LEFT(A8,2)=\"V*\",\"var\",\"\")","v":""},"Be*","","Be",0.4109621,"0 1 38.6",60.449921400000001," 60 26 59.71",8.58,8.4700000000000006,"B1Vn           ","B1","Vn        ",0.4109621,60.449921400000001,2.5299999999999994]
["HR 9086","","*  ",null,"",0.43270750000000002,"0 1 43.8",42.367143489999997,"+42 22 1.71",6.1989999999999998,6.2430000000000003,"B9IIImnp...    ","B9","IIImnp... ",0.43270750000000002,42.367143489999997,4.7569999999999997]
["HD 224939","","*  ",null,"",0.49692751000000002,"0 1 59.2",63.357827729999997,"+63 21 28.17",8.68,8.6,"B8V            ","B8","V         ",0.49692751000000002,63.357827729999997,2.4000000000000004]
["BD+62 2352","","*  ",null,"",0.52026700000000003,"0 2 4.8",62.897880999999998,"+62 53 52.37",10.199999999999999,9.82,"B8V            ","B8","V         ",0.52026700000000003,62.897880999999998,1.1799999999999997]
["BD+66 1674","","*iC","","",0.54269199999999995,"0 2 10.2",67.429242000000002,"+67 25 45.27",10.67,9.6,"B0IIIn         ","B0","IIIn      ",0.54269199999999995,67.429242000000002,1.4000000000000004]
["HD 225095","","Em*","Em","",0.86311388,"0 3 27.1",55.55089821,"+55 33 3.23",7.91,7.95,"B2IVne         ","B2","IVne      ",0.86311388,55.55089821,3.05]
["BD+61 2583","","*  ",null,"",0.86376699000000001,"0 3 27.3",62.357806940000003,"+62 21 28.1",8.7899999999999991,8.67,"B8V            ","B8","V         ",0.86376699000000001,62.357806940000003,2.33]
["HD 225190","","*  ","","",1.08873332,"0 4 21.2",54.274592040000002,"+54 16 28.53",7.7,7.79,"B3V            ","B3","V         ",1.08873332,54.274592040000002,3.21]
["ADS 30","","** ",null,"",1.1524460999999999,"0 4 36.5",42.092531049999998,"+42 5 33.11",6.27,6.12,"B9III          ","B9","III       ",1.1524460999999999,42.092531049999998,4.88]
["CCDM J00049+5832AB","","** ","","",1.22906911,"0 4 54.9",58.532167090000002,"+58 31 55.8",null,6.6,"B3V            ","B3","V         ",1.22906911,58.532167090000002,4.4000000000000004]
["V567 Cas","Var","a2*",null,"",1.2756247300000001,"0 5 6.1",61.31397029,"+61 18 50.29",5.7229999999999999,5.79,"B8mnp...       ","B8","mnp...    ",1.2756247300000001,61.31397029,5.21]
["BD+62 2362","","*  ",null,"",1.3497475000000001,"0 5 23.9",63.789116700000001,"+63 47 20.82",9.92,9.74,"B7III          ","B7","III       ",1.3497475000000001,63.789116700000001,1.2599999999999998]
["HD 73","","V* ","","",1.4040142600000001,"0 5 36.9",43.401420709999996,"+43 24 5.11",8.26,8.4499999999999993,"B1.5IV         ","B1","IV        ",1.4040142600000001,43.401420709999996,2.5500000000000007]
["10 Cas","","Be*",null,"Be",1.61058678,"0 6 26.5",64.196168900000004,"+64 11 46.2",5.5410000000000004,5.5670000000000002,"B9IIIe         ","B9","IIIe      ",1.61058678,64.196168900000004,5.4329999999999998]
["BD+59 2829","","Be*","","Be",1.701255,"0 6 48.3",60.6002303,"+60 36 0.82",10.14,9.86,"B0IV:npe       ","B0","IV:npe    ",1.701255,60.6002303,1.1400000000000006]
["ADS 75 A","","*i*",null,"",1.79321,"0 7 10.3",63.156390000000002,"+63 9 23",10,null,"B7IV           ","B7","IV        ",1.79321,63.156390000000002,11]
["HD 236309","","*i*",null,"",2.0550342000000001,"0 8 13.2",59.215788600000003,"+59 12 56.83",9.9700000000000006,9.77,"B9V            ","B9","V         ",2.0550342000000001,59.215788600000003,1.2300000000000004]
["BD+61 5","","*  ",null,"",2.0912929,"0 8 21.9",62.383069999999996,"+62 22 59.05",9.06,8.9600000000000009,"B6V            ","B6","V         ",2.0912929,62.383069999999996,2.0399999999999991]
["HD 470","","*  ",null,"",2.3469863200000001,"0 9 23.2",58.665895720000002,"+58 39 57.22",8.3000000000000007,8.26,"B5V             ","B5","V         ",2.3469863200000001,58.665895720000002,2.74]
["HD 470","","*  ",null,"",2.3469863200000001,"0 9 23.2",58.665895720000002,"+58 39 57.22",8.3000000000000007,8.26,"B5V             ","B5","V         ",2.3469863200000001,58.665895720000002,2.74]
["CCDM J00100+1109A","","*i*",null,"",2.50915,"0 10 2.1",11.145816999999999,"+11 8 44.94",5.5,5.53,"B9V            ","B9","V         ",2.50915,11.145816999999999,5.47]
["34 Psc","","** ",null,"",2.50917887,"0 10 2.2",11.14581332,"+11 8 44.92",5.4729999999999999,5.5369999999999999,"B9Vn           ","B9","Vn        ",2.50917887,11.14581332,5.4630000000000001]
["HR 28","","*  ",null,"",2.62366849,"0 10 29.6",57.165495579999998,"+57 9 55.78",6.6429999999999998,6.7210000000000001,"B7IV           ","B7","IV        ",2.62366849,57.165495579999998,4.2789999999999999]
["HD 593                   ",{"$f":"IF(LEFT(A31,2)=\"V*\",\"var\",\"\")","v":""},"*  ","","",2.6444173000000002,"0 10 34.6",59.673407699999998," 59 40 24.26",6.6859999999999999,6.7039999999999997,"B1V            ","B1","V         ",2.6444173000000002,59.673407699999998,4.2960000000000003]
["HD 594","","*iN","","",2.6552229000000001,"0 10 37.2",58.748249199999997,"+58 44 53.69",8.1999999999999993,8.1,"B3IV           ","B3","IV        ",2.6552229000000001,58.748249199999997,2.9000000000000004]
["HD 236327","","*iN",null,"",2.6757882999999998,"0 10 42.1",58.746268600000001,"+58 44 46.56",8.73,8.64,"B6V            ","B6","V         ",2.6757882999999998,58.746268600000001,2.3599999999999994]
["HD 627","","*  ",null,"",2.6931925400000001,"0 10 46.3",58.76951597,"+58 46 10.25",8.3699999999999992,8.25,"B7V            ","B7","V         ",2.6931925400000001,58.76951597,2.75]
["BD+62 11","","Be*",null,"Be",2.6955024999999999,"0 10 46.9",63.172936700000001,"+63 10 22.57",9.82,9.6,"B5V             ","B5","V         ",2.6955024999999999,63.172936700000001,1.4000000000000004]
["BD+62 11","","Be*",null,"Be",2.6955024999999999,"0 10 46.9",63.172936700000001,"+63 10 22.57",9.82,9.6,"B5V             ","B5","V         ",2.6955024999999999,63.172936700000001,1.4000000000000004]
["BD+62 16","","*  ",null,"",2.9068554,"0 11 37.6",62.921100299999999,"+62 55 15.96",10.01,9.7799999999999994,"B8V            ","B8","V         ",2.9068554,62.921100299999999,1.2200000000000006]
["V470 And","Var","LP*","","",3.2093572899999998,"0 12 50.2",37.693656650000001,"+37 41 37.16",6.5860000000000003,6.7009999999999996,"B2V            ","B2","V         ",3.2093572899999998,37.693656650000001,4.2990000000000004]
["gam Peg","Var","bC*","","",3.3089634600000002,"0 13 14.1",15.18359354,"+15 11 0.93",2.6,2.83,"B2IV           ","B2","IV        ",3.3089634600000002,15.18359354,8.17]
["BD+61 17","","*  ","","",3.6004233000000001,"0 14 24.1",62.661948299999999,"+62 39 43.01",9.93,9.84,"B3V            ","B3","V         ",3.6004233000000001,62.661948299999999,1.1600000000000001]
["HD 1009","","*  ",null,"",3.6779643200000001,"0 14 42.7",64.566156489999997,"+64 33 58.16",8.5399999999999991,8.3800000000000008,"B9V...         ","B9","V...      ",3.6779643200000001,64.566156489999997,2.6199999999999992]
["V348 And","Var","Al*",null,"",3.8243033799999999,"0 15 17.8",44.203396529999999,"+44 12 12.22",6.7110000000000003,6.6,"B9V            ","B9","V         ",3.8243033799999999,44.203396529999999,4.4000000000000004]
["BD+76 5A","","*i*",null,"",4.0580170000000004,"0 16 13.9",76.950761,"+76 57 2.73",6.97,7.04,"B8V            ","B8","V         ",4.0580170000000004,76.950761,3.96]
["CCDM J00162+7657AB","","** ",null,"",4.0580846800000003,"0 16 13.9",76.950753390000003,"+76 57 2.71",6.3230000000000004,6.3890000000000002,"B8Vnn          ","B8","Vnn       ",4.0580846800000003,76.950753390000003,4.6109999999999998]
["HR 62","","*  ",null,"",4.2876813800000004,"0 17 9",47.9474059,"+47 56 50.66",5.7729999999999997,5.851,"B7III          ","B7","III       ",4.2876813800000004,47.9474059,5.149]
["HD 1334","","*  ","","",4.45990647,"0 17 50.3",59.057589069999999,"+59 3 27.32",7.7,7.69,"B2.5V          ","B2","V         ",4.45990647,59.057589069999999,3.3099999999999996]
["26 And","","*i*",null,"",4.6757019900000003,"0 18 42.1",43.791140370000001,"+43 47 28.1",6.03,6.11,"B8V            ","B8","V         ",4.6757019900000003,43.791140370000001,4.8899999999999997]
["BD+62 49","","*  ","","",4.7411778499999997,"0 18 57.8",63.571991949999997,"+63 34 19.17",9.2799999999999994,8.99,"B0.5III        ","B0","III       ",4.7411778499999997,63.571991949999997,2.0099999999999998]
["TV Cas","Var","Al*",null,"",4.82809299,"0 19 18.7",59.139044570000003,"+59 8 20.56",7.32,7.28,"B9V            ","B9","V         ",4.82809299,59.139044570000003,3.7199999999999998]
["HD 1544","","*  ","","",5.0230915700000001,"0 20 5.5",62.066305249999999,"+62 3 58.69",8.25,8.14,"B0.5IIIn...    ","B0","IIIn...   ",5.0230915700000001,62.066305249999999,2.8599999999999994]
["BD+61 39","","Be*","","Be",5.0726487000000002,"0 20 17.4",62.463865599999998,"+62 27 49.91",9,8.85,"B0.5IV         ","B0","IV        ",5.0726487000000002,62.463865599999998,2.1500000000000004]
["HR 78","","V* ",null,"",5.1016733399999996,"0 20 24.4",30.93561278,"+30 56 8.2",5.77,5.8710000000000004,"B7V            ","B7","V         ",5.1016733399999996,30.93561278,5.1289999999999996]
["HD 236382","","*  ","","",5.1253285100000001,"0 20 30",60.285453820000001,"+60 17 7.63",9.02,8.84,"B2III          ","B2","III       ",5.1253285100000001,60.285453820000001,2.16]
["BD+66 20A","","*i*",null,"",5.3423699999999998,"0 21 22.1",67.005420000000001,"+67 0 19.51",7.2,7.2,"B8V            ","B8","V         ",5.3423699999999998,67.005420000000001,3.8]
["BD+63 33                 ",{"$f":"IF(LEFT(A55,2)=\"V*\",\"var\",\"\")","v":""},"*  ","","",5.4595241999999997,"0 21 50.2",64.595099200000007," 64 35 42.35",9.89,9.48,"B1V            ","B1","V         ",5.4595241999999997,64.595099200000007,1.5199999999999996]
["V745 Cas","Var","WU*","","",5.7221710000000003,"0 22 53.3",62.241408,"+62 14 29.06",8.17,8.11,"B0IV           ","B0","IV        ",5.7221710000000003,62.241408,2.8900000000000006]
["V746 Cas","Var","LP*",null,"",6.0652381000000002,"0 24 15.6",52.019915220000001,"+52 1 11.69",5.4669999999999996,5.5750000000000002,"B5IV            ","B5","IV        ",6.0652381000000002,52.019915220000001,5.4249999999999998]
["V746 Cas","Var","LP*",null,"",6.0652381000000002,"0 24 15.6",52.019915220000001,"+52 1 11.69",5.4669999999999996,5.5750000000000002,"B5IV            ","B5","IV        ",6.0652381000000002,52.019915220000001,5.4249999999999998]
["HD 1939","","*  ",null,"",6.0731257699999999,"0 24 17.5",64.300184340000001,"+64 18 0.66",8.82,8.61,"B9V            ","B9","V         ",6.0731257699999999,64.300184340000001,2.3900000000000006]
["12 Cas","","*  ",null,"",6.1979408899999999,"0 24 47.5",61.831055499999998,"+61 49 51.79",5.3860000000000001,5.383,"B9III          ","B9","III       ",6.1979408899999999,61.831055499999998,5.617]
["HR 96","","*  ",null,"",6.2767121799999996,"0 25 6.4",53.046786830000002,"+53 2 48.43",5.6619999999999999,5.718,"B9IV           ","B9","IV        ",6.2767121799999996,53.046786830000002,5.282]
["HD 2083                  ",{"$f":"IF(LEFT(A62,2)=\"V*\",\"var\",\"\")","v":""},"Em*","Em","",6.4634885899999999,"0 25 51.2",71.8071269," 71 48 25.65",6.8819999999999997,6.9059999999999997,"B1V            ","B1","V         ",6.4634885899999999,71.8071269,4.0940000000000003]
["BD+61 77                 ",{"$f":"IF(LEFT(A63,2)=\"V*\",\"var\",\"\")","v":""},"*  ","","",6.5967195299999997,"0 26 23.2",62.760799200000001," 62 45 38.87",9.76,9.61,"B1IV           ","B1","IV        ",6.5967195299999997,62.760799200000001,1.3900000000000006]
["BD+62 79","","*  ","","",6.6266683000000004,"0 26 30.4",63.442264199999997,"+63 26 32.15",9.56,9.25,"O9.5IV           ","O9","IV        ",6.6266683000000004,63.442264199999997,1.75]
["HD 2244","","*  ",null,"",6.6644468899999998,"0 26 39.4",56.641206590000003,"+56 38 28.34",6.59,6.58,"B9V            ","B9","V         ",6.6644468899999998,56.641206590000003,4.42]
["BD+63 48                 ",{"$f":"IF(LEFT(A66,2)=\"V*\",\"var\",\"\")","v":""},"Be*","","Be",6.6671233000000001,"0 26 40.1",64.432061700000006," 64 25 55.42",9.9700000000000006,9.26,"B1III:nne      ",{"$f":"+LEFT(L66,2)","v":"B1"},{"$f":"+IF(MID(L66,3,1)=\".\",MID(L66,5,10),MID(L66,3,10))","v":"III:nne   "},6.6671233000000001,64.432061700000006,{"$f":"11-K66","v":1.7400000000000002}]
["HD 2329","","*  ","","",6.9188227900000001,"0 27 40.5",58.55391083,"+58 33 14.07",7.4989999999999997,7.4589999999999996,"B3V            ","B3","V         ",{"$f":"+F67","v":6.9188227900000001},{"$f":"+H67","v":58.55391083},3.5410000000000004]
["HD 236419","","*iC","","",6.9768292000000001,"0 27 54.4",60.6252894,"+60 37 31.04",9.39,9.18,"B2III          ","B2","III       ",6.9768292000000001,60.6252894,1.8200000000000003]
["HD 2451","","*  ","","",7.1998776700000002,"0 28 47.9",62.506271859999998,"+62 30 22.57",8.85,8.74,"B0.5IV...      ","B0","IV...     ",7.1998776700000002,62.506271859999998,2.2599999999999998]
["HD 2559","","*  ",null,"",7.4494488499999996,"0 29 47.8",57.030709080000001,"+57 1 50.55",7.54,7.54,"B8V            ","B8","V         ",7.4494488499999996,57.030709080000001,3.46]
["HR 113","","*  ","","",7.5830529899999997,"0 30 19.9",59.97755592,"+59 58 39.2",5.9359999999999999,5.9429999999999996,"B9IIIn         ","B9","IIIn      ",7.5830529899999997,59.97755592,5.0570000000000004]
["HD 2619","","*  ","","",7.6180466600000001,"0 30 28.3",65.272156350000003,"+65 16 19.76",8.7799999999999994,8.33,"B0.5III        ","B0","III       ",7.6180466600000001,65.272156350000003,2.67]
["HD 2654","","*  ","","",7.6734156499999999,"0 30 41.6",62.354003390000003,"+62 21 14.41",7.36,7.3920000000000003,"B2V            ","B2","V         ",7.6734156499999999,62.354003390000003,3.6079999999999997]
["13 Cas","","*  ",null,"",7.85512196,"0 31 25.2",66.519616569999997,"+66 31 10.61",6.0720000000000001,6.1719999999999997,"B6V            ","B6","V         ",7.85512196,66.519616569999997,4.8280000000000003]
["lam Cas","","*  ",null,"",7.9431639499999998,"0 31 46.3",54.522284919999997,"+54 31 20.22",4.6449999999999996,4.7320000000000002,"B8Vn           ","B8","Vn        ",7.9431639499999998,54.522284919999997,6.2679999999999998]
["HD 2789","","Be*","","Be",8.0118431599999997,"0 32 2.8",67.161132649999999,"+67 9 40.07",8.6300000000000008,8.36,"B3Vne          ","B3","Vne       ",8.0118431599999997,67.161132649999999,2.6400000000000006]
["HD 236455","","*  ",null,"",8.0253508,"0 32 6",57.107880600000001,"+57 6 28.37",9.44,9.34,"B9V            ","B9","V         ",8.0253508,57.107880600000001,1.6600000000000001]
["16 Cas","","*  ","","",8.6038405000000004,"0 34 24.9",66.750349279999995,"+66 45 1.25",6.4180000000000001,6.468,"B9III          ","B9","III       ",8.6038405000000004,66.750349279999995,4.532]
["HD 3191                  ",{"$f":"IF(LEFT(A79,2)=\"V*\",\"var\",\"\")","v":""},"*  ","","",8.9618601200000008,"0 35 50.8",61.459810849999997," 61 27 35.31",8.9499999999999993,8.6199999999999992,"B1IV:nn        ","B1","IV:nn     ",8.9618601200000008,61.459810849999997,2.3800000000000008]
["HR 144","","*  ",null,"",9.0346248899999999,"0 36 8.3",54.168448349999998,"+54 10 6.41",4.9790000000000001,5.0750000000000002,"B7III          ","B7","III       ",9.0346248899999999,54.168448349999998,5.9249999999999998]
["HD 3264","","*  ","","",9.0644087800000008,"0 36 15.4",48.555764080000003,"+48 33 20.75",7.48,7.52,"B2V            ","B2","V         ",9.0644087800000008,48.555764080000003,3.4800000000000004]
["PY And","Var","a2*",null,"",9.0837442999999993,"0 36 20",27.25476441,"+27 15 17.15",6.423,6.4969999999999999,"B8IIImnp...    ","B8","IIImnp... ",9.0837442999999993,27.25476441,4.5030000000000001]
["AG Psc","Var","bC*","","",9.1971342400000005,"0 36 47.3",15.23172641,"+15 13 54.21",5.7249999999999996,5.8639999999999999,"B2.5IV         ","B2","IV        ",9.1971342400000005,15.23172641,5.1360000000000001]
["29 And","","*  ",null,"",9.2202052299999995,"0 36 52.8",33.719344,"+33 43 9.63",4.2229999999999999,4.335,"B5V             ","B5","V         ",9.2202052299999995,33.719344,6.665]
["29 And","","*  ",null,"",9.2202052299999995,"0 36 52.8",33.719344,"+33 43 9.63",4.2229999999999999,4.335,"B5V             ","B5","V         ",9.2202052299999995,33.719344,6.665]
["zet Cas","","Pu*","","",9.2428507799999995,"0 36 58.2",53.896907579999997,"+53 53 48.86",3.4830000000000001,3.6659999999999999,"B2IV           ","B2","IV        ",9.2428507799999995,53.896907579999997,7.3339999999999996]
["HD 3377","","*  ",null,"",9.3181011700000003,"0 37 16.3",58.01621205,"+58 0 58.36",7.44,7.44,"B9III          ","B9","III       ",9.3181011700000003,58.01621205,3.5599999999999996]
["BD+60 82","","*  ","","",10.300340800000001,"0 41 12",61.599541700000003,"+61 35 58.35",10.16,9.98,"B2III          ","B2","III       ",10.300340800000001,61.599541700000003,1.0199999999999996]
["ksi Cas","","*  ","","",10.516230910000001,"0 42 3.8",50.512525420000003,"+50 30 45.09",4.681,4.7969999999999997,"B2V            ","B2","V         ",10.516230910000001,50.512525420000003,6.2030000000000003]
["HD 3950                  ",{"$f":"IF(LEFT(A90,2)=\"V*\",\"var\",\"\")","v":""},"*  ","","",10.658288629999999,"0 42 37.9",52.337152570000001," 52 20 13.74",6.9939999999999998,6.944,"B1III          ","B1","III       ",10.658288629999999,52.337152570000001,4.056]
["HR 189","","*  ",null,"",11.109133959999999,"0 44 26.1",47.863984160000001,"+47 51 50.34",5.5339999999999998,5.6459999999999999,"B5V             ","B5","V         ",11.109133959999999,47.863984160000001,5.3540000000000001]
["HR 189","","*  ",null,"",11.109133959999999,"0 44 26.1",47.863984160000001,"+47 51 50.34",5.5339999999999998,5.6459999999999999,"B5V             ","B5","V         ",11.109133959999999,47.863984160000001,5.3540000000000001]
["BD+60 94","","*iC",null,"",11.127814239999999,"0 44 30.6",61.780539249999997,"+61 46 49.94",9.76,9.64,"B8V            ","B8","V         ",11.127814239999999,61.780539249999997,1.3599999999999994]
["BD+61 162","","*iC",null,"",11.16859606,"0 44 40.4",61.900491479999999,"+61 54 1.76",9.82,9.6999999999999993,"B9V            ","B9","V         ",11.16859606,61.900491479999999,1.3000000000000007]
["BD+61 163","","*iC",null,"",11.170088399999999,"0 44 40.8",61.812032559999999,"+61 48 43.31",9.41,9.2799999999999994,"B6.5IV-V       ","B6","IV-V      ",11.170088399999999,61.812032559999999,1.7200000000000006]
["omi Cas","","Be*",null,"Be",11.181327769999999,"0 44 43.5",48.284364879999998,"+48 17 3.71",4.4320000000000004,4.4770000000000003,"B5IIIe          ","B5","IIIe      ",11.181327769999999,48.284364879999998,6.5229999999999997]
["omi Cas","","Be*",null,"Be",11.181327769999999,"0 44 43.5",48.284364879999998,"+48 17 3.71",4.4320000000000004,4.4770000000000003,"B5IIIe          ","B5","IIIe      ",11.181327769999999,48.284364879999998,6.5229999999999997]
["BD+63 87","","*  ","","",11.197636299999999,"0 44 47.4",64.337143100000006,"+64 20 13.71",10.337999999999999,9.9779999999999998,"B0.5IV         ","B0","IV        ",11.197636299999999,64.337143100000006,1.0220000000000002]
["BD+34 113","","*  ","","",11.643520000000001,"0 46 34.4",34.828792499999999,"+34 49 43.65",11.12,9.9,"B2III:e        ","B2","III:e     ",11.643520000000001,34.828792499999999,1.0999999999999996]
["HD 4460","","*  ","","",11.829253919999999,"0 47 19",47.805747199999999,"+47 48 20.68",8.25,8.4,"B1.5Vn...      ","B1","Vn...     ",11.829253919999999,47.805747199999999,2.5999999999999996]
["23 Cas","","*  ",null,"",11.941890430000001,"0 47 46",74.847571310000006,"+74 50 51.25",5.351,5.4169999999999998,"B8III          ","B8","III       ",11.941890430000001,74.847571310000006,5.5830000000000002]
["25 Cas","","V* ",null,"",12.20842455,"0 48 50",50.96816716,"+50 58 5.4",4.8120000000000003,4.9009999999999998,"B9III          ","B9","III       ",12.20842455,50.96816716,6.0990000000000002]
["HD 236534","","*  ",null,"",12.2441771,"0 48 58.6",58.201947500000003,"+58 12 7.01",9.5500000000000007,9.4,"B9V            ","B9","V         ",12.2441771,58.201947500000003,1.5999999999999996]
["HD 236541","","*  ","","",12.447162499999999,"0 49 47.3",57.609612499999997,"+57 36 34.6",9.7799999999999994,9.67,"B9V            ","B9","V         ",12.447162499999999,57.609612499999997,1.33]
["35 And","","SB*",null,"",12.453530689999999,"0 49 48.8",41.078910110000002,"+41 4 44.07",4.3899999999999997,4.524,"B5V+...         ","B5","V+...     ",12.453530689999999,41.078910110000002,6.476]
["35 And","","SB*",null,"",12.453530689999999,"0 49 48.8",41.078910110000002,"+41 4 44.07",4.3899999999999997,4.524,"B5V+...         ","B5","V+...     ",12.453530689999999,41.078910110000002,6.476]
["BD+60 114","","Be*","","Be",12.563416699999999,"0 50 15.2",60.9025544,"+60 54 9.19",10.29,9.94,"B2III:pe       ","B2","III:pe    ",12.563416699999999,60.9025544,1.0600000000000005]
["HD 4854","","*  ","","",12.8736017,"0 51 29.6",61.137453600000001,"+61 8 14.83",9.2899999999999991,9.26,"B9V            ","B9","V         ",12.8736017,61.137453600000001,1.7400000000000002]
["HD 4931","","Be*",null,"Be",13.064386020000001,"0 52 15.4",60.089946990000001,"+60 5 23.8",9.01,8.7200000000000006,"B8V            ","B8","V         ",13.064386020000001,60.089946990000001,2.2799999999999994]
["HD 4978","","*  ",null,"",13.1774296,"0 52 42.5",61.717376700000003,"+61 43 2.55",9.41,9.19,"B9V            ","B9","V         ",13.1774296,61.717376700000003,1.8100000000000005]
["HD 5233","","*  ","","",13.75427449,"0 55 1",61.662415709999998,"+61 39 44.69",8.48,8.41,"B3V            ","B3","V         ",13.75427449,61.662415709999998,2.59]
["BD+60 133","","*  ",null,"",13.8303546,"0 55 19.2",61.265973299999999,"+61 15 57.5",9.84,9.5399999999999991,"B8V            ","B8","V         ",13.8303546,61.265973299999999,1.4600000000000009]
["HD 236578","","*  ",null,"",14.105309200000001,"0 56 25.2",60.006262499999998,"+60 0 22.54",9.86,8.99,"B8V            ","B8","V         ",14.105309200000001,60.006262499999998,2.0099999999999998]
["gam Cas","","Be*","","Be",14.1772154,"0 56 42.5",60.716740299999998,"+60 43 0.26",2.29,2.4700000000000002,"B0.5IVpe       ","B0","IVpe      ",14.1772154,60.716740299999998,8.5299999999999994]
["HD 5409","","*  ",null,"",14.19028814,"0 56 45.6",60.03315928,"+60 1 59.37",7.91,7.86,"B9V            ","B9","V         ",14.19028814,60.03315928,3.1399999999999997]
["ADS 784 A","","*i*",null,"",14.19558,"0 56 46.9",60.362859999999998,"+60 21 46.29",5.5,5.6,"B8V            ","B8","V         ",14.19558,60.362859999999998,5.4]
["HR 266","","*  ",null,"",14.19571524,"0 56 46.9",60.362838670000002,"+60 21 46.21",5.5010000000000003,5.556,"B9IVn          ","B9","IVn       ",14.19571524,60.362838670000002,5.444]
["HD 5553","","*  ","","",14.532047540000001,"0 58 7.6",55.824375930000002,"+55 49 27.75",8.1300000000000008,8.14,"B1.5III-IVn... ","B1","III-IVn...",14.532047540000001,55.824375930000002,2.8599999999999994]
["HD 5595","","*  ",null,"",14.677410800000001,"0 58 42.5",62.110109999999999,"+62 6 36.39",9.52,9.4,"B8V            ","B8","V         ",14.677410800000001,62.110109999999999,1.5999999999999996]
["HD 5882","","*  ","","",15.23527573,"1 0 56.4",50.879014640000001,"+50 52 44.45",7.61,7.67,"B2.5Vn         ","B2","Vn        ",15.23527573,50.879014640000001,3.33]
["BD+62 183                ",{"$f":"IF(LEFT(A121,2)=\"V*\",\"var\",\"\")","v":""},"*  ","","",15.285710399999999,"1 1 8.5",63.441340599999997," 63 26 28.82",9.5299999999999994,8.98,"B1V:p          ","B1","V:p       ",15.285710399999999,63.441340599999997,2.0199999999999996]
["U Cep","Var","Al*",null,"",15.57685936,"1 2 18.4",81.875577410000005,"+81 52 32.07",6.92,6.92,"B7V+G8III-IV   ","B7","V+G8III-IV",15.57685936,81.875577410000005,4.08]
["BD+62 186                ",{"$f":"IF(LEFT(A123,2)=\"V*\",\"var\",\"\")","v":""},"*  ","","",15.621843800000001,"1 2 29.2",62.983551400000003," 62 59 0.78",10.14,9.92,"B1V            ","B1","V         ",15.621843800000001,62.983551400000003,1.08]
["BD+60 149","","*  ",null,"",15.701634200000001,"1 2 48.3",60.860645300000002,"+60 51 38.32",10.029999999999999,9.92,"B4III          ","B4","III       ",15.701634200000001,60.860645300000002,1.08]
["HD 236605","","*  ",null,"",15.7447046,"1 2 58.7",58.248282500000002,"+58 14 53.81",9.33,9.2200000000000006,"B9p            ","B9","p         ",15.7447046,58.248282500000002,1.7799999999999994]
["HD 236612","","*  ","","",16.1498758,"1 4 35.9",60.3363625,"+60 20 10.9",9.56,9.34,"B2IV           ","B2","IV        ",16.1498758,60.3363625,1.6600000000000001]
["HR 302","","*  ",null,"",16.194994739999999,"1 4 46.7",51.00978156,"+51 0 35.21",6.444,6.5250000000000004,"B3V            ","B3","V         ",16.194994739999999,51.00978156,4.4749999999999996]
["HD 6343","","Be*",null,"Be",16.470746389999999,"1 5 52.9",65.971053269999999,"+65 58 15.79",7.3479999999999999,7.2569999999999997,"B7V            ","B7","V         ",16.470746389999999,65.971053269999999,3.7430000000000003]
["V760 Cas","Var","LP*","","",16.51647651,"1 6 3.9",57.75647575,"+57 45 23.31",7.1189999999999998,7.1070000000000002,"B3III          ","B3","III       ",16.51647651,57.75647575,3.8929999999999998]
["HD 6581","","*  ",null,"",16.976059769999999,"1 7 54.2",62.33532143,"+62 20 7.15",8.66,8.56,"B8III          ",{"$f":"+LEFT(L130,2)","v":"B8"},{"$f":"+IF(MID(L130,3,1)=\".\",MID(L130,5,10),MID(L130,3,10))","v":"III       "},16.976059769999999,62.33532143,{"$f":"11-K130","v":2.4399999999999995}]
["HD 6633","","*  ",null,"",17.09207,"1 8 22",62.2420306,"+62 14 31.31",9.67,9.31,"B9III          ","B9","III       ",{"$f":"+F131","v":17.09207},{"$f":"+H131","v":62.2420306},1.6899999999999995]
["HR 326","","*  ",null,"",17.139444520000001,"1 8 33.4",58.263448050000001,"+58 15 48.41",5.7539999999999996,5.7729999999999997,"B8V            ","B8","V         ",17.139444520000001,58.263448050000001,5.2270000000000003]
["HD 236633","","*  ","","",17.301420799999999,"1 9 12.3",60.628038099999998,"+60 37 40.93",9.49,9.18,"B0.5III        ","B0","III       ",17.301420799999999,60.628038099999998,1.8200000000000003]
["HD 6675","","*  ","","",17.304478379999999,"1 9 13",69.686523539999996,"+69 41 11.48",7.1550000000000002,6.94,"B0.5III        ","B0","III       ",17.304478379999999,69.686523539999996,4.0599999999999996]
["BD+62 212","","*  ","","",17.315306199999998,"1 9 15.6",63.681253099999999,"+63 40 52.51",10.27,9.6,"B0.5V          ","B0","V         ",17.315306199999998,63.681253099999999,1.4000000000000004]
["phi And","","*  ",null,"",17.375523399999999,"1 9 30.1",47.241794290000001,"+47 14 30.45",4.1970000000000001,4.2519999999999998,"B7Ve           ","B7","Ve        ",17.375523399999999,47.241794290000001,6.7480000000000002]
["BD+60 171","","*  ","","",17.388157499999998,"1 9 33.1",61.385811400000001,"+61 23 8.92",9.59,9.34,"B3III          ","B3","III       ",17.388157499999998,61.385811400000001,1.6600000000000001]
["HD 6832","","*i*",null,"",17.542159789999999,"1 10 10.1",61.808145830000001,"+61 48 29.32",8.34,8.2899999999999991,"B9III          ","B9","III       ",17.542159789999999,61.808145830000001,2.7100000000000009]
["BD+60 175                ",{"$f":"IF(LEFT(A139,2)=\"V*\",\"var\",\"\")","v":""},"*  ","","",17.7368317,"1 10 56.8",61.092129999999997," 61 5 31.66",9.68,9.4499999999999993,"B1V            ","B1","V         ",17.7368317,61.092129999999997,1.5500000000000007]
["BD+59 198","","*  ",null,"",17.768204600000001,"1 11 4.3",60.022578299999999,"+60 1 21.28",10.02,9.85,"B8III          ","B8","III       ",17.768204600000001,60.022578299999999,1.1500000000000004]
["45 And","","*  ",null,"",17.79282516,"1 11 10.2",37.724125700000002,"+37 43 26.85",5.69,5.7839999999999998,"B7III-IV       ","B7","III-IV    ",17.79282516,37.724125700000002,5.2160000000000002]
["RU Cas","Var","V* ",null,"",17.92250623,"1 11 41.4",65.018852050000007,"+65 1 7.86",5.492,5.5640000000000001,"B9IV           ","B9","IV        ",17.92250623,65.018852050000007,5.4359999999999999]
["HD 7104","","*  ",null,"",18.149314199999999,"1 12 35.8",61.775198600000003,"+61 46 30.71",8.93,8.84,"B8V            ","B8","V         ",18.149314199999999,61.775198600000003,2.16]
["V761 Cas","Var","a2*",null,"",18.29105985,"1 13 9.8",61.706185249999997,"+61 42 22.26",6.4290000000000003,6.4459999999999997,"B9V            ","B9","V         ",18.29105985,61.706185249999997,4.5540000000000003]
["BD+59 206","","*  ","","",18.396097099999999,"1 13 35",60.645570800000002,"+60 38 44.05",9.76,9.6,"B9V            ","B9","V         ",18.396097099999999,60.645570800000002,1.4000000000000004]
["HD 236667","","*  ",null,"",18.469573109999999,"1 13 52.6",59.05509842,"+59 3 18.35",9.3699999999999992,9.25,"B8V            ","B8","V         ",18.469573109999999,59.05509842,1.75]
["HD 7252                  ",{"$f":"IF(LEFT(A147,2)=\"V*\",\"var\",\"\")","v":""},"*  ","","",18.51521236,"1 14 3.6",60.883117919999997," 60 52 59.22",7.2140000000000004,7.1849999999999996,"B1V...         ","B1","V...      ",18.51521236,60.883117919999997,3.8150000000000004]
["87 Psc","","*  ",null,"",18.531790709999999,"1 14 7.6",16.133477729999999,"+16 8 0.51",5.8739999999999997,5.9569999999999999,"B8III          ","B8","III       ",18.531790709999999,16.133477729999999,5.0430000000000001]
["BD+60 191","","*  ","","",18.625867,"1 14 30.2",61.332275000000003,"+61 19 56.19",10.55,9.94,"B2IV           ","B2","IV        ",18.625867,61.332275000000003,1.0600000000000005]
["QV And","Var","a2*",null,"",19.102050779999999,"1 16 24.4",48.08224517,"+48 4 56.08",6.5670000000000002,6.6130000000000004,"B9IIIsp...     ","B9","IIIsp...  ",19.102050779999999,48.08224517,4.3869999999999996]
["HD 7636","","Be*","","Be",19.3595516,"1 17 26.2",57.632081450000001,"+57 37 55.49",6.93,6.891,"B2IIIne        ","B2","IIIne     ",19.3595516,57.632081450000001,4.109]
["HD 7694                  ",{"$f":"IF(LEFT(A152,2)=\"V*\",\"var\",\"\")","v":""},"*  ","","",19.459895110000001,"1 17 50.3",55.445391260000001," 55 26 43.4",7.25,7.38,"B1V            ","B1","V         ",19.459895110000001,55.445391260000001,3.62]
["HD 236689","","Be*","","Be",19.6378129,"1 18 33",58.375138900000003,"+58 22 30.5",9.7200000000000006,9.4700000000000006,"B1.5V:pe       ","B1","V:pe      ",19.6378129,58.375138900000003,1.5299999999999994]
["BD+60 203","","*  ","","",19.724393800000001,"1 18 53.8",61.571553600000001,"+61 34 17.59",9.64,9.51,"B9V            ","B9","V         ",19.724393800000001,61.571553600000001,1.4900000000000002]
["Cl* NGC 457 HOAG 4","","*iC",null,"",19.78575,"1 19 8.5",58.237609999999997,"+58 14 15.39",9.99,9.6,"B6V:e          ","B6","V:e       ",19.78575,58.237609999999997,1.4000000000000004]
["BD+57 247","","*iC","","",19.792792899999998,"1 19 10.2",58.349183600000003,"+58 20 57.06",10.06,9.93,"O9.5IV           ","O9","IV        ",19.792792899999998,58.349183600000003,1.0700000000000003]
["BD+57 249                ",{"$f":"IF(LEFT(A157,2)=\"V*\",\"var\",\"\")","v":""},"*i*","","",19.8458854,"1 19 23",58.305644399999998," 58 18 20.31",10.25,9.9600000000000009,"B1V(~)         ","B1","V(~)      ",19.8458854,58.305644399999998,1.0399999999999991]
["BD+57 252                ",{"$f":"IF(LEFT(A158,2)=\"V*\",\"var\",\"\")","v":""},"*iC","","",19.892412,"1 19 34.1",58.256135999999998," 58 15 22.08",9.76,9.5,"B1IV           ","B1","IV        ",19.892412,58.256135999999998,1.5]
["BD+64 156","","*  ","","",20.946071700000001,"1 23 47",65.628964400000001,"+65 37 44.27",10.029999999999999,9.5299999999999994,"B0.5III        ","B0","III       ",20.946071700000001,65.628964400000001,1.4700000000000006]
["BD+60 232","","Em*","Em","",21.274881700000002,"1 25 5.9",60.801518299999998,"+60 48 5.46",10.199999999999999,9.98,"B2III          ","B2","III       ",21.274881700000002,60.801518299999998,1.0199999999999996]
["HR 419","","*i*","","",21.72313235,"1 26 53.5",3.5356466900000001,"+3 32 8.32",6.5810000000000004,6.6440000000000001,"B9V+...        ","B9","V+...     ",21.72313235,3.5356466900000001,4.3559999999999999]
["HD 8736","","*  ",null,"",21.935998470000001,"1 27 44.6",62.773420989999998,"+62 46 24.31",9.09,8.89,"B9V            ","B9","V         ",21.935998470000001,62.773420989999998,2.1099999999999994]
["BD+58 241                ",{"$f":"IF(LEFT(A163,2)=\"V*\",\"var\",\"\")","v":""},"*  ","","",21.978655360000001,"1 27 54.8",59.235808749999997," 59 14 8.91",10.14,9.91,"B1V            ","B1","V         ",21.978655360000001,59.235808749999997,1.0899999999999999]
["HD 236745","","*  ",null,"",21.990931700000001,"1 27 57.8",58.356006700000002,"+58 21 21.62",9.76,9.5500000000000007,"B5V             ","B5","V         ",21.990931700000001,58.356006700000002,1.4499999999999993]
["HD 236745","","*  ",null,"",21.990931700000001,"1 27 57.8",58.356006700000002,"+58 21 21.62",9.76,9.5500000000000007,"B5V             ","B5","V         ",21.990931700000001,58.356006700000002,1.4499999999999993]
["HD 8769","","*  ",null,"",22.005020609999999,"1 28 1.2",61.324993110000001,"+61 19 29.97",9.3800000000000008,9.3000000000000007,"B9V            ","B9","V         ",22.005020609999999,61.324993110000001,1.6999999999999993]
["HD 8768","","*  ","","",22.013132030000001,"1 28 3.1",63.282548509999998,"+63 16 57.17",9.0500000000000007,8.74,"O9.5IV           ","O9","IV        ",22.013132030000001,63.282548509999998,2.2599999999999998]
["XX Cas","Var","Al*",null,"",22.394212899999999,"1 29 34.6",60.967962800000002,"+60 58 4.66",9.73,9.57,"B4Vn           ","B4","Vn        ",22.394212899999999,60.967962800000002,1.4299999999999997]
["HD 8965","","*  ","","",22.464016000000001,"1 29 51.3",60.251266299999997,"+60 15 4.55",7.2850000000000001,7.2969999999999997,"B0.5V          ","B0","V         ",22.464016000000001,60.251266299999997,3.7030000000000003]
["CCDM J01301+6335AB       ",{"$f":"IF(LEFT(A170,2)=\"V*\",\"var\",\"\")","v":""},"** ","","",22.524812000000001,"1 30 5.9",63.582307999999998," 63 34 56.3",10.54,9.8699999999999992,"B1IV           ","B1","IV        ",22.524812000000001,63.582307999999998,1.1300000000000008]
["HD 236758","","*  ",null,"",22.5288304,"1 30 6.9",57.984281099999997,"+57 59 3.41",9.41,9.32,"B9V            ","B9","V         ",22.5288304,57.984281099999997,1.6799999999999997]
["V646 Cas","Var","Al*","","",22.646077900000002,"1 30 35",62.725229200000001,"+62 43 30.82",10.14,9.73,"B0IV:nn        ","B0","IV:nn     ",22.646077900000002,62.725229200000001,1.2699999999999996]
["HD 236761","","*  ",null,"",22.6740517,"1 30 41.7",58.234122499999998,"+58 14 2.84",9.7799999999999994,9.6199999999999992,"B8V            ","B8","V         ",22.6740517,58.234122499999998,1.3800000000000008]
["HD 236762","","*  ","","",22.760640710000001,"1 31 2.5",59.73720127,"+59 44 13.92",9.73,9.59,"B1.5III        ","B1","III       ",22.760640710000001,59.73720127,1.4100000000000001]
["HD 9145","","*i*",null,"",22.921510399999999,"1 31 41.1",61.042892199999997,"+61 2 34.41",8.23,8.08,"B7III          ","B7","III       ",22.921510399999999,61.042892199999997,2.92]
["HR 438","","*  ",null,"",23.03157216,"1 32 7.5",34.79996242,"+34 47 59.86",6.274,6.375,"B7IIImnp...    ","B7","IIImnp... ",23.03157216,34.79996242,4.625]
["V1116 Cas","Var","bC*","","",23.154023299999999,"1 32 36.9",61.9699028,"+61 58 11.65",9.77,9.5,"B0.5III        ","B0","III       ",23.154023299999999,61.9699028,1.5]
["HD 9256","","*  ",null,"",23.180501929999998,"1 32 43.3",61.861338420000003,"+61 51 40.81",8.9499999999999993,8.84,"B7V            ","B7","V         ",23.180501929999998,61.861338420000003,2.16]
["V1122 Cas","Var","Be*",null,"Be",23.312580000000001,"1 33 15",60.683500000000002,"+60 41 0.6",9.9,9.6199999999999992,"B5V             ","B5","V         ",23.312580000000001,60.683500000000002,1.3800000000000008]
["V1122 Cas","Var","Be*",null,"Be",23.312580000000001,"1 33 15",60.683500000000002,"+60 41 0.6",9.9,9.6199999999999992,"B5V             ","B5","V         ",23.312580000000001,60.683500000000002,1.3800000000000008]
["HD 236785","","*  ",null,"",23.4586729,"1 33 50",58.533887499999999,"+58 32 1.99",9.91,9.8000000000000007,"B8V            ","B8","V         ",23.4586729,58.533887499999999,1.1999999999999993]
["HD 9480","","** ",null,"",23.502738910000001,"1 34 0.6",45.976573170000002,"+45 58 35.66",8.6999999999999993,8.6999999999999993,"B9V            ","B9","V         ",23.502738910000001,45.976573170000002,2.3000000000000007]
["KK And","Var","a2*",null,"",23.569196590000001,"1 34 16.6",37.237144209999997,"+37 14 13.71",5.81,5.91,"B9IV           ","B9","IV        ",23.569196590000001,37.237144209999997,5.09]
["HD 236788","","*  ",null,"",23.645748300000001,"1 34 34.9",58.184876899999999,"+58 11 5.55",9.2100000000000009,9,"B9V            ","B9","V         ",23.645748300000001,58.184876899999999,2]
["BD+62 271","","Be*",null,"Be",23.704479200000002,"1 34 49",63.626619699999999,"+63 37 35.83",9.16,8.58,"B8V            ","B8","V         ",23.704479200000002,63.626619699999999,2.42]
["HD 9709","","Be*",null,"Be",24.012854260000001,"1 36 3",47.114471139999999,"+47 6 52.09",7.02,7.07,"B8V            ","B8","V         ",24.012854260000001,47.114471139999999,3.9299999999999997]
["HD 9682","","*  ",null,"",24.1063771,"1 36 25.5",60.765519400000002,"+60 45 55.86",9.2100000000000009,9.1199999999999992,"B9V            ","B9","V         ",24.1063771,60.765519400000002,1.8800000000000008]
["HD 9696","","*  ",null,"",24.158090820000002,"1 36 37.9",61.276726719999999,"+61 16 36.21",9,8.77,"B8V            ","B8","V         ",24.158090820000002,61.276726719999999,2.2300000000000004]
["HD 9824","","*  ","","",24.195882999999998,"1 36 47",43.769441999999998,"+43 46 9.99",9.3699999999999992,9.34,"B9V            ","B9","V         ",24.195882999999998,43.769441999999998,1.6600000000000001]
["V769 Cas","Var","LP*",null,"",24.196006409999999,"1 36 47",63.414476200000003,"+63 24 52.11",7.71,7.62,"B8III          ","B8","III       ",24.196006409999999,63.414476200000003,3.38]
["TYC 4035-1518-1          ",{"$f":"IF(LEFT(A191,2)=\"V*\",\"var\",\"\")","v":""},"*  ","","",24.210342900000001,"1 36 50.4",62.301496100000001," 62 18 5.38",10.24,9.8699999999999992,"B1V            ","B1","V         ",24.210342900000001,62.301496100000001,1.1300000000000008]
["HD 236800                ",{"$f":"IF(LEFT(A192,2)=\"V*\",\"var\",\"\")","v":""},"*  ","","",24.2118754,"1 36 50.8",59.942883100000003," 59 56 34.37",9.83,9.6199999999999992,"B1III:n        ","B1","III:n     ",24.2118754,59.942883100000003,1.3800000000000008]
["BD+62 278","","*  ","","",24.254400799999999,"1 37 1",63.727532199999999,"+63 43 39.11",10.45,9.93,"B0.5III        ","B0","III       ",24.254400799999999,63.727532199999999,1.0700000000000003]
["HR 449","","Be*",null,"Be",24.342594030000001,"1 37 22.2",74.30095575,"+74 18 3.44",6.5960000000000001,6.5890000000000004,"B9Ve           ",{"$f":"+LEFT(L194,2)","v":"B9"},{"$f":"+IF(MID(L194,3,1)=\".\",MID(L194,5,10),MID(L194,3,10))","v":"Ve        "},24.342594030000001,74.30095575,{"$f":"11-K194","v":4.4109999999999996}]
["HD 9937","","*i*",null,"",24.4819371,"1 37 55.6",43.670380299999998,"+43 40 13.36",8.81,8.82,"B8V            ","B8","V         ",{"$f":"+F195","v":24.4819371},{"$f":"+H195","v":43.670380299999998},2.1799999999999997]
["HD 9878","","*  ",null,"",24.552649769999999,"1 38 12.6",62.351783949999998,"+62 21 6.42",6.6980000000000004,6.7140000000000004,"B7V            ","B7","V         ",24.552649769999999,62.351783949999998,4.2859999999999996]
["HD 236810","","*  ","","",24.609513790000001,"1 38 26.2",60.562966420000002,"+60 33 46.67",8.9,8.73,"B2III          ","B2","III       ",24.609513790000001,60.562966420000002,2.2699999999999996]
["GY And","Var","a2*",null,"",24.63260262,"1 38 31.8",45.399703440000003,"+45 23 58.93",6.3479999999999999,6.3879999999999999,"B9pe...        ","B9","pe...     ",24.63260262,45.399703440000003,4.6120000000000001]
["BD+62 285","","Be*",null,"Be",24.773657100000001,"1 39 5.6",63.462871399999997,"+63 27 46.33",9.36,8.85,"B8V            ","B8","V         ",24.773657100000001,63.462871399999997,2.1500000000000004]
["HD 236815","","*  ","","",24.83849786,"1 39 21.2",60.40843228,"+60 24 30.35",8.7100000000000009,8.56,"B0.5III        ","B0","III       ",24.83849786,60.40843228,2.4399999999999995]
["BD+62 287","","Be*",null,"Be",25.0901025,"1 40 21.6",63.114414699999998,"+63 6 51.89",9.35,9.07,"B8V            ","B8","V         ",25.0901025,63.114414699999998,1.9299999999999997]
["tau And","","V* ",null,"",25.145068550000001,"1 40 34.8",40.577048400000002,"+40 34 37.37",4.8689999999999998,4.96,"B5III           ","B5","III       ",25.145068550000001,40.577048400000002,6.04]
["tau And","","V* ",null,"",25.145068550000001,"1 40 34.8",40.577048400000002,"+40 34 37.37",4.8689999999999998,4.96,"B5III           ","B5","III       ",25.145068550000001,40.577048400000002,6.04]
["HD 10223","","*  ","","",25.4200658,"1 41 40.8",61.093515799999999,"+61 5 36.65",8.68,8.57,"B9V            ","B9","V         ",25.4200658,61.093515799999999,2.4299999999999997]
["BD+42 350","","*  ",null,"",25.485447099999998,"1 41 56.5",43.518094699999999,"+43 31 5.14",9.77,9.58,"B8V            ","B8","V         ",25.485447099999998,43.518094699999999,1.42]
["V772 Cas","Var","a2*",null,"",25.512127849999999,"1 42 2.9",61.038238389999997,"+61 2 17.65",6.657,6.6849999999999996,"B8IIIsp...     ","B8","IIIsp...  ",25.512127849999999,61.038238389999997,4.3150000000000004]
["HR 490","","*  ",null,"",25.514540790000002,"1 42 3.4",35.245704979999999,"+35 14 44.53",5.5709999999999997,5.63,"B9IV-V         ","B9","IV-V      ",25.514540790000002,35.245704979999999,5.37]
["HR 482","","*i*",null,"",25.573758250000001,"1 42 17.7",58.627738530000002,"+58 37 39.85",6.3230000000000004,6.3529999999999998,"B8III          ","B8","III       ",25.573758250000001,58.627738530000002,4.6470000000000002]
["42 Cas","","Al*",null,"",25.732767339999999,"1 42 55.8",70.622524830000003,"+70 37 21.08",5.1550000000000002,5.1769999999999996,"B9V            ","B9","V         ",25.732767339999999,70.622524830000003,5.8230000000000004]
["BD+60 313","","*  ",null,"",25.755563299999999,"1 43 1.3",60.935357799999998,"+60 56 7.28",9.5,9.31,"B6V            ","B6","V         ",25.755563299999999,60.935357799999998,1.6899999999999995]
["BD+61 312                ",{"$f":"IF(LEFT(A211,2)=\"V*\",\"var\",\"\")","v":""},"*  ","","",25.782314199999998,"1 43 7.7",62.460590799999999," 62 27 38.12",9.67,9.26,"B1III          ","B1","III       ",25.782314199999998,62.460590799999999,1.7400000000000002]
["BD+62 296                ",{"$f":"IF(LEFT(A212,2)=\"V*\",\"var\",\"\")","v":""},"*  ","","",25.790445800000001,"1 43 9.7",63.605370600000001," 63 36 19.33",10.3,9.8699999999999992,"B1IV           ","B1","IV        ",25.790445800000001,63.605370600000001,1.1300000000000008]
["HD 10375","","*  ",null,"",25.79444165,"1 43 10.6",62.643471159999997,"+62 38 36.49",8.4,8.25,"B9V            ","B9","V         ",25.79444165,62.643471159999997,2.75]
["BD+61 314","","*iC",null,"",25.79755067,"1 43 11.4",62.094083959999999,"+62 5 38.7",9.5299999999999994,9.4499999999999993,"B9III          ","B9","III       ",25.79755067,62.094083959999999,1.5500000000000007]
["44 Cas","","*  ",null,"",25.83231022,"1 43 19.7",60.551334150000002,"+60 33 4.8",5.76,5.76,"B8IIIn         ","B8","IIIn      ",25.83231022,60.551334150000002,5.24]
["phi Per","Var","RI*","","",25.915158000000002,"1 43 39.6",50.688731339999997,"+50 41 19.43",4,4.09,"B2Vpe          ","B2","Vpe       ",25.915158000000002,50.688731339999997,6.91]
["BD+60 322","","*  ","","",26.247181300000001,"1 44 59.3",60.806040000000003,"+60 48 21.74",10.27,9.84,"B2III          ","B2","III       ",26.247181300000001,60.806040000000003,1.1600000000000001]
["BD+62 300                ",{"$f":"IF(LEFT(A218,2)=\"V*\",\"var\",\"\")","v":""},"Be*","","Be",26.277781300000001,"1 45 6.6",62.830848099999997," 62 49 51.05",10.23,9.92,"B1V:npe        ","B1","V:npe     ",26.277781300000001,62.830848099999997,1.08]
["BD+61 319","","*iC",null,"",26.346115399999999,"1 45 23",61.7458253,"+61 44 44.97",9.99,9.8000000000000007,"B8V            ","B8","V         ",26.346115399999999,61.7458253,1.1999999999999993]
["HD 10664","","*  ",null,"",26.492093090000001,"1 45 58.1",62.93682604,"+62 56 12.57",9.25,8.9600000000000009,"B9V            ","B9","V         ",26.492093090000001,62.93682604,2.0399999999999991]
["HD 10916","","*  ",null,"",27.025566699999999,"1 48 6.1",43.273733100000001,"+43 16 25.43",9.4,9.3800000000000008,"B8V            ","B8","V         ",27.025566699999999,43.273733100000001,1.6199999999999992]
["HD 10842","","*  ",null,"",27.03077176,"1 48 7.3",61.834128399999997,"+61 50 2.86",9.02,8.8699999999999992,"B9V            ","B9","V         ",27.03077176,61.834128399999997,2.1300000000000008]
["HD 10993","","*  ","","",27.238392099999999,"1 48 57.2",42.707835299999999,"+42 42 28.2",9.31,9.31,"B9V            ","B9","V         ",27.238392099999999,42.707835299999999,1.6899999999999995]
["BD+61 332","","*  ",null,"",27.331531200000001,"1 49 19.5",61.935324999999999,"+61 56 7.16",10.18,9.94,"B6V            ","B6","V         ",27.331531200000001,61.935324999999999,1.0600000000000005]
["BD+59 328","","*  ",null,"",27.343215399999998,"1 49 22.3",60.564628300000003,"+60 33 52.66",9.94,9.74,"B5V             ","B5","V         ",27.343215399999998,60.564628300000003,1.2599999999999998]
["BD+59 328","","*  ",null,"",27.343215399999998,"1 49 22.3",60.564628300000003,"+60 33 52.66",9.94,9.74,"B5V             ","B5","V         ",27.343215399999998,60.564628300000003,1.2599999999999998]
["HD 10972","","*  ",null,"",27.4009617,"1 49 36.2",61.023078900000002,"+61 1 23.08",8.6,8.48,"B9V            ","B9","V         ",27.4009617,61.023078900000002,2.5199999999999996]
["BD+63 247","","*  ","","",27.406108799999998,"1 49 37.4",64.325982199999999,"+64 19 33.53",10.02,9.83,"B0III          ","B0","III       ",27.406108799999998,64.325982199999999,1.17]
["BD+60 362","","*  ","","",27.732192099999999,"1 50 55.7",61.350653600000001,"+61 21 2.35",10.06,9.6,"B2II-III       ","B2","II-III    ",27.732192099999999,61.350653600000001,1.4000000000000004]
["HD 11126","","*  ",null,"",27.830515699999999,"1 51 19.3",60.353614909999997,"+60 21 13.01",8.1300000000000008,8.0299999999999994,"B8V            ","B8","V         ",27.830515699999999,60.353614909999997,2.9700000000000006]
["HD 11162","","*  ",null,"",27.916791400000001,"1 51 40",61.830645089999997,"+61 49 50.32",9.52,9.1999999999999993,"B9V            ","B9","V         ",27.916791400000001,61.830645089999997,1.8000000000000007]
["V775 Cas","Var","Al*",null,"",27.960347909999999,"1 51 50.4",63.454061359999997,"+63 27 14.62",9.9700000000000006,9.7899999999999991,"B8V            ","B8","V         ",27.960347909999999,63.454061359999997,1.2100000000000009]
["BD+54 395","","*  ","","",27.9723267,"1 51 53.3",55.470397200000001,"+55 28 13.42",10.02,9.9600000000000009,"B0IV:p         ","B0","IV:p      ",27.9723267,55.470397200000001,1.0399999999999991]
["V436 Per","Var","Al*","","",27.997165070000001,"1 51 59.3",55.14738243,"+55 8 50.57",5.3390000000000004,5.5110000000000001,"B1.5V          ","B1","V         ",27.997165070000001,55.14738243,5.4889999999999999]
["2 Per","","*  ",null,"",28.0390473,"1 52 9.3",50.792793940000003,"+50 47 34.05",5.6280000000000001,5.6950000000000003,"B9pHgMn        ","B9","pHgMn     ",28.0390473,50.792793940000003,5.3049999999999997]
["BD+61 339","","*  ",null,"",28.09976,"1 52 23.9",62.042112799999998,"+62 2 31.6",10.1,9.89,"B7III          ","B7","III       ",28.09976,62.042112799999998,1.1099999999999994]
["HD 232552","","Be*","","Be",28.108715109999999,"1 52 26",55.331595149999998,"+55 19 53.74",8.24,7.94,"B0pe           ","B0","pe        ",28.108715109999999,55.331595149999998,3.0599999999999996]
["BD+58 315                ",{"$f":"IF(LEFT(A238,2)=\"V*\",\"var\",\"\")","v":""},"*  ","","",28.221854199999999,"1 52 53.2",59.574435299999998," 59 34 27.96",10.130000000000001,9.99,"B1V            ","B1","V         ",28.221854199999999,59.574435299999998,1.0099999999999998]
["BD+54 404                ",{"$f":"IF(LEFT(A239,2)=\"V*\",\"var\",\"\")","v":""},"*  ","","",28.2967917,"1 53 11.2",55.123528100000001," 55 7 24.7",9.9,9.77,"B1III          ","B1","III       ",28.2967917,55.123528100000001,1.2300000000000004]
["BD+63 253","","*  ","","",28.353217730000001,"1 53 24.7",64.189472039999998,"+64 11 22.09",9.74,9.39,"B0III          ","B0","III       ",28.353217730000001,64.189472039999998,1.6099999999999994]
["HR 545","","*i*",null,"",28.382383000000001,"1 53 31.7",19.296185999999999,"+19 17 46.26",4.5599999999999996,4.7,"B9V            ","B9","V         ",28.382383000000001,19.296185999999999,6.3]
["BD+19 302","","*  ","","",28.4974992,"1 53 59.3",20.7115939,"+20 42 41.73",9.86,9.94,"B2.5V:         ","B2","V:        ",28.4974992,20.7115939,1.0600000000000005]
["eps Cas","","Be*","","Be",28.59885697,"1 54 23.7",63.670100789999999,"+63 40 12.36",3.218,3.3420000000000001,"B3III          ","B3","III       ",28.59885697,63.670100789999999,7.6579999999999995]
["HD 11463","","*  ",null,"",28.632422930000001,"1 54 31.7",59.893687149999998,"+59 53 37.27",8.4600000000000009,8.32,"B9IV           ","B9","IV        ",28.632422930000001,59.893687149999998,2.6799999999999997]
["HD 11471","","*  ",null,"",28.680040420000001,"1 54 43.2",61.991453900000003,"+61 59 29.23",8.83,8.77,"B9V            ","B9","V         ",28.680040420000001,61.991453900000003,2.2300000000000004]
["HD 11554                 ",{"$f":"IF(LEFT(A246,2)=\"V*\",\"var\",\"\")","v":""},"Be*","","Be",28.802412499999999,"1 55 12.5",57.897618299999998," 57 53 51.42",9.73,9.4700000000000006,"B1Vpe          ","B1","Vpe       ",28.802412499999999,57.897618299999998,1.5299999999999994]
["BD+59 355","","*  ","","",28.925902900000001,"1 55 42.2",60.245952199999998,"+60 14 45.42",9.98,9.77,"B0.5V          ","B0","V         ",28.925902900000001,60.245952199999998,1.2300000000000004]
["HD 11606","","Be*","","Be",28.92856102,"1 55 42.8",59.273449990000003,"+59 16 24.41",7.08,7.02,"B2Vne          ","B2","Vne       ",28.92856102,59.273449990000003,3.9800000000000004]
["HD 11605","","*  ",null,"",28.976072049999999,"1 55 54.2",62.363495380000003,"+62 21 48.58",7.6920000000000002,7.5880000000000001,"B8V            ","B8","V         ",28.976072049999999,62.363495380000003,3.4119999999999999]
["ome Cas","","*  ",null,"",29.000116009999999,"1 56 0",68.685240620000002,"+68 41 6.86",4.8869999999999996,4.97,"B5III           ","B5","III       ",29.000116009999999,68.685240620000002,6.03]
["ome Cas","","*  ",null,"",29.000116009999999,"1 56 0",68.685240620000002,"+68 41 6.86",4.8869999999999996,4.97,"B5III           ","B5","III       ",29.000116009999999,68.685240620000002,6.03]
["BD+55 441                ",{"$f":"IF(LEFT(A252,2)=\"V*\",\"var\",\"\")","v":""},"Be*","","Be",29.02974802,"1 56 7.1",56.554379349999998," 56 33 15.76",9.92,9.81,"B1V:pe         ","B1","V:pe      ",29.02974802,56.554379349999998,1.1899999999999995]
["CCDM J01564+6117AB","","** ",null,"",29.09819924,"1 56 23.5",61.281077789999998,"+61 16 51.88",7.54,7.46,"B7V            ","B7","V         ",29.09819924,61.281077789999998,3.54]
["HD 11734","","*  ","","",29.254163800000001,"1 57 0.9",59.997669399999999,"+59 59 51.6",9.0500000000000007,8.81,"B2IV           ","B2","IV        ",29.254163800000001,59.997669399999999,2.1899999999999995]
["HD 11745","","*  ",null,"",29.278852100000002,"1 57 6.9",60.484855600000003,"+60 29 5.48",10.119999999999999,9.8699999999999992,"B8V            ","B8","V         ",29.278852100000002,60.484855600000003,1.1300000000000008]
["HD 11772","","*  ",null,"",29.366504200000001,"1 57 27.9",61.264319999999998,"+61 15 51.55",9.7799999999999994,9.5399999999999991,"B8V            ","B8","V         ",29.366504200000001,61.264319999999998,1.4600000000000009]
["HD 11744","","*  ","","",29.402815329999999,"1 57 36.6",65.410086399999997,"+65 24 36.31",8.18,7.81,"B2III          ","B2","III       ",29.402815329999999,65.410086399999997,3.1900000000000004]
["BD+62 328","","*  ",null,"",29.432809200000001,"1 57 43.8",63.081058599999999,"+63 4 51.81",9.82,9.49,"B6III          ",{"$f":"+LEFT(L258,2)","v":"B6"},{"$f":"+IF(MID(L258,3,1)=\".\",MID(L258,5,10),MID(L258,3,10))","v":"III       "},29.432809200000001,63.081058599999999,{"$f":"11-K258","v":1.5099999999999998}]
["TYC 3696-46-1            ",{"$f":"IF(LEFT(A259,2)=\"V*\",\"var\",\"\")","v":""},"*  ","","",29.450655399999999,"1 57 48.1",59.9754875," 59 58 31.75",10.25,9.9700000000000006,"B1V            ","B1","V         ",{"$f":"+F259","v":29.450655399999999},{"$f":"+H259","v":59.9754875},1.0299999999999994]
["HR 562","","*  ",null,"",29.48485968,"1 57 56.3",41.694559660000003,"+41 41 40.41",6.6989999999999998,6.7720000000000002,"B8III          ","B8","III       ",29.48485968,41.694559660000003,4.2279999999999998]
["HD 11837","","*  ",null,"",29.512962420000001,"1 58 3.1",57.963752579999998,"+57 57 49.5",9.02,8.86,"B9IV           ","B9","IV        ",29.512962420000001,57.963752579999998,2.1400000000000006]
["HD 11859","","*  ",null,"",29.589017160000001,"1 58 21.3",60.045908060000002,"+60 2 45.26",8.74,8.64,"B9III          ","B9","III       ",29.589017160000001,60.045908060000002,2.3599999999999994]
["HR 561","","V* ",null,"",29.63847977,"1 58 33.2",61.697789299999997,"+61 41 52.04",5.9710000000000001,6.0149999999999997,"B5III           ","B5","III       ",29.63847977,61.697789299999997,4.9850000000000003]
["BD+59 369","","*  ",null,"",29.757400799999999,"1 59 1.7",60.163683900000002,"+60 9 49.26",10.199999999999999,9.91,"B8V            ","B8","V         ",29.757400799999999,60.163683900000002,1.0899999999999999]
["BD+58 343","","*  ","","",29.767824600000001,"1 59 4.2",58.942834400000002,"+58 56 34.2",9.92,9.64,"B2III          ","B2","III       ",29.767824600000001,58.942834400000002,1.3599999999999994]
["HD 11918","","*  ",null,"",29.774607240000002,"1 59 5.9",61.541931650000002,"+61 32 30.95",8.24,8.1,"B9IV           ","B9","IV        ",29.774607240000002,61.541931650000002,2.9000000000000004]
["HD 11947","","*  ",null,"",29.820063300000001,"1 59 16.8",61.140046099999999,"+61 8 24.16",9.35,9.15,"B8V            ","B8","V         ",29.820063300000001,61.140046099999999,1.8499999999999996]
["HD 236923                ",{"$f":"IF(LEFT(A268,2)=\"V*\",\"var\",\"\")","v":""},"*  ","","",29.9924146,"1 59 58.1",59.722116700000001," 59 43 19.62",10.029999999999999,9.76,"B1V            ","B1","V         ",29.9924146,59.722116700000001,1.2400000000000002]
["HD 12122","","*  ",null,"",30.224875149999999,"2 0 53.9",60.421621850000001,"+60 25 17.83",9.1300000000000008,8.9600000000000009,"B7III          ","B7","III       ",30.224875149999999,60.421621850000001,2.0399999999999991]
["HD 12150","","*i*","","",30.29377491,"2 1 10.5",58.203499720000003,"+58 12 12.59",8.85,8.68,"B2IV           ","B2","IV        ",30.29377491,58.203499720000003,2.3200000000000003]
["BD+60 416","","*  ","","",30.434217100000001,"2 1 44.2",61.053608099999998,"+61 3 12.98",10.08,9.61,"B0.5III        ","B0","III       ",30.434217100000001,61.053608099999998,1.3900000000000006]
["HD 12192","","*  ",null,"",30.442825819999999,"2 1 46.2",61.75268964,"+61 45 9.68",9.08,8.8800000000000008,"B5V...          ","B5","V...      ",30.442825819999999,61.75268964,2.1199999999999992]
["HD 12192","","*  ",null,"",30.442825819999999,"2 1 46.2",61.75268964,"+61 45 9.68",9.08,8.8800000000000008,"B5V...          ","B5","V...      ",30.442825819999999,61.75268964,2.1199999999999992]
["HD 12243","","*  ",null,"",30.52773629,"2 2 6.6",60.29487237,"+60 17 41.54",8.06,7.99,"B8V            ","B8","V         ",30.52773629,60.29487237,3.01]
["g Per","","*  ",null,"",30.575452869999999,"2 2 18.1",54.487541319999998,"+54 29 15.14",4.923,4.9930000000000003,"B8III          ","B8","III       ",30.575452869999999,54.487541319999998,6.0069999999999997]
["HD 12342","","*  ",null,"",30.693803129999999,"2 2 46.5",57.310257190000002,"+57 18 36.92",8.73,8.7100000000000009,"B7IV           ","B7","IV        ",30.693803129999999,57.310257190000002,2.2899999999999991]
["HD 12340","","*  ",null,"",30.755786260000001,"2 3 1.3",61.065157079999999,"+61 3 54.56",9.5399999999999991,9.34,"B9III          ","B9","III       ",30.755786260000001,61.065157079999999,1.6600000000000001]
["BD+59 393","","*  ",null,"",30.8145071,"2 3 15.4",59.922308600000001,"+59 55 20.31",10.1,9.7799999999999994,"B8V            ","B8","V         ",30.8145071,59.922308600000001,1.2200000000000006]
["HD 232590","","Be*","","Be",30.9537087,"2 3 48.8",55.120695599999998,"+55 7 14.5",8.65,8.6199999999999992,"B1.5III        ","B1","III       ",30.9537087,55.120695599999998,2.3800000000000008]
["HR 604","","*i*",null,"",30.978120000000001,"2 3 54.7",42.331000000000003,"+42 19 51.6",4.87,4.84,"B8V+...        ","B8","V+...     ",30.978120000000001,42.331000000000003,6.16]
["HD 12493","","*  ",null,"",31.156832130000002,"2 4 37.6",61.74452994,"+61 44 40.3",9.7100000000000009,9.31,"B8V            ","B8","V         ",31.156832130000002,61.74452994,1.6899999999999995]
["BD+61 375","","*  ","","",31.255411299999999,"2 5 1.2",62.086671699999997,"+62 5 12.01",10.01,9.5500000000000007,"B0.5IV         ","B0","IV        ",31.255411299999999,62.086671699999997,1.4499999999999993]
["HD 12509                 ",{"$f":"IF(LEFT(A283,2)=\"V*\",\"var\",\"\")","v":""},"*  ","","",31.256070770000001,"2 5 1.4",64.385595300000006," 64 23 8.14",7.3810000000000002,7.1360000000000001,"B1III          ","B1","III       ",31.256070770000001,64.385595300000006,3.8639999999999999]
["HD 12581","","*iA",null,"",31.266872100000001,"2 5 4",58.387072500000002,"+58 23 13.46",9.18,9.1199999999999992,"B9V            ","B9","V         ",31.266872100000001,58.387072500000002,1.8800000000000008]
["HD 12580","","*  ",null,"",31.296766300000002,"2 5 11.2",59.104941099999998,"+59 6 17.78",9.9499999999999993,9.8000000000000007,"B8V            ","B8","V         ",31.296766300000002,59.104941099999998,1.1999999999999993]
["HD 12567","","*  ","","",31.382583520000001,"2 5 31.8",64.287028609999993,"+64 17 13.3",8.6300000000000008,8.31,"B0.5III        ","B0","III       ",31.382583520000001,64.287028609999993,2.6899999999999995]
["HD 12624","","*  ",null,"",31.4023033,"2 5 36.5",57.763263899999998,"+57 45 47.75",9.74,9.6300000000000008,"B8V            ","B8","V         ",31.4023033,57.763263899999998,1.3699999999999992]
["HD 12709","","*  ",null,"",31.56843224,"2 6 16.4",57.307130839999999,"+57 18 25.67",8.0399999999999991,7.98,"B4IV           ","B4","IV        ",31.56843224,57.307130839999999,3.0199999999999996]
["HD 12727","","V* ","","",31.621895479999999,"2 6 29.2",57.046267700000001,"+57 2 46.56",9.07,9.02,"B2III          ","B2","III       ",31.621895479999999,57.046267700000001,1.9800000000000004]
["HD 12708","","*  ","","",31.6292382,"2 6 31",61.044809219999998,"+61 2 41.31",8.8800000000000008,8.68,"B9V            ","B9","V         ",31.6292382,61.044809219999998,2.3200000000000003]
["CCDM J02068+2542AB","","** ",null,"",31.705148229999999,"2 6 49.2",25.704553860000001,"+25 42 16.39",6.12,6.15,"B9IV-Vn        ","B9","IV-Vn     ",31.705148229999999,25.704553860000001,4.8499999999999996]
["HD 12749","","*  ",null,"",31.763651200000002,"2 7 3.2",60.124805299999998,"+60 7 29.29",9.68,9.41,"B9V            ","B9","V         ",31.763651200000002,60.124805299999998,1.5899999999999999]
["BD+59 409","","*  ",null,"",31.803357500000001,"2 7 12.8",60.193003300000001,"+60 11 34.81",9.9600000000000009,9.57,"B6V            ","B6","V         ",31.803357500000001,60.193003300000001,1.4299999999999997]
["HD 12856","","Be*","","Be",31.972577909999998,"2 7 53.4",57.105685860000001,"+57 6 20.46",8.75,8.6,"B0pe           ","B0","pe        ",31.972577909999998,57.105685860000001,2.4000000000000004]
["HD 12867                 ",{"$f":"IF(LEFT(A295,2)=\"V*\",\"var\",\"\")","v":""},"*  ","","",31.973705840000001,"2 7 53.6",57.71263845," 57 42 45.49",9.5299999999999994,9.5299999999999994,"B1V            ","B1","V         ",31.973705840000001,57.71263845,1.4700000000000006]
["BD+60 435","","*  ","","",32.023177500000003,"2 8 5.5",61.401688900000003,"+61 24 6.08",10.01,9.64,"B2III          ","B2","III       ",32.023177500000003,61.401688900000003,1.3599999999999994]
["BD+62 351","","*  ",null,"",32.062443559999998,"2 8 14.9",62.814466349999996,"+62 48 52.07",9.68,9.52,"B8V            ","B8","V         ",32.062443559999998,62.814466349999996,1.4800000000000004]
["HD 12928","","*  ",null,"",32.12890238,"2 8 30.9",58.865286359999999,"+58 51 55.03",8.01,7.86,"B8III          ","B8","III       ",32.12890238,58.865286359999999,3.1399999999999997]
["HD 12964","","*i*",null,"",32.2030946,"2 8 48.7",58.532504400000001,"+58 31 57.01",9.93,9.82,"B6V            ","B6","V         ",32.2030946,58.532504400000001,1.1799999999999997]
["BD+62 353","","*  ",null,"",32.228418300000001,"2 8 54.8",63.0697489,"+63 4 11.09",10.119999999999999,9.8800000000000008,"B8V            ","B8","V         ",32.228418300000001,63.0697489,1.1199999999999992]
["HD 12994","","*  ",null,"",32.258518690000002,"2 9 2",57.035982169999997,"+57 2 9.53",8.4700000000000006,8.48,"B7IV           ","B7","IV        ",32.258518690000002,57.035982169999997,2.5199999999999996]
["V351 Per              ","var","bC*","","",32.357065570000003,"2 9 25.6",56.991705899999999," 56 59 30.14",8.75,8.64,"B1IV:          ","B1","IV:       ",32.357065570000003,56.991705899999999,2.3599999999999994]
["HD 13112","","*iC",null,"",32.587736999999997,"2 10 21",59.258681000000003,"+59 15 31.25",9.82,9.59,"B8III          ","B8","III       ",32.587736999999997,59.258681000000003,1.4100000000000001]
["HR 628","","*i*",null,"",32.720100850000001,"2 10 52.8",39.0395708,"+39 2 22.45",6.01,6.07,"B9V            ","B9","V         ",32.720100850000001,39.0395708,4.93]
["HD 13310","","*  ",null,"",32.9699679,"2 11 52.7",54.967643899999999,"+54 58 3.51",9.4600000000000009,9.43,"B9V            ","B9","V         ",32.9699679,54.967643899999999,1.5700000000000003]
["HD 13331","","*  ",null,"",33.029487510000003,"2 12 7",57.312774279999999,"+57 18 45.98",8.81,8.7899999999999991,"B8III          ","B8","III       ",33.029487510000003,57.312774279999999,2.2100000000000009]
["HD 13338","","*  ","","",33.079887100000001,"2 12 19.1",57.940868600000002,"+57 56 27.12",9.3800000000000008,9.17,"O9.5V            ","O9","V         ",33.079887100000001,57.940868600000002,1.83]
["BD+57 513                ",{"$f":"IF(LEFT(A308,2)=\"V*\",\"var\",\"\")","v":""},"*  ","","",33.150278299999997,"2 12 36",58.0983625," 58 5 54.1",9.76,9.56,"B1III          ","B1","III       ",33.150278299999997,58.0983625,1.4399999999999995]
["BD+57 515","","Be*","","Be",33.17671,"2 12 42.4",57.69211,"+57 41 31.59",9.99,9.76,"B2pe           ","B2","pe        ",33.17671,57.69211,1.2400000000000002]
["HD 13429","","Be*","","Be",33.252116200000003,"2 13 0.5",55.1109972,"+55 6 39.58",9.2799999999999994,9.19,"B3V            ","B3","V         ",33.252116200000003,55.1109972,1.8100000000000005]
["HD 13420","","*  ",null,"",33.291161700000004,"2 13 9.8",58.554756699999999,"+58 33 17.12",9.83,9.61,"B4III          ","B4","III       ",33.291161700000004,58.554756699999999,1.3900000000000006]
["V* V352 Per              ",{"$f":"IF(LEFT(A312,2)=\"V*\",\"var\",\"\")","v":"var"},"bC*","","",33.404239199999999,"2 13 37",56.570625300000003," 56 34 14.25",9.4700000000000006,9.31,"B1III          ","B1","III       ",33.404239199999999,56.570625300000003,1.6899999999999995]
["HD 13506","","*  ",null,"",33.440739200000003,"2 13 45.7",57.5136672,"+57 30 49.2",9.49,9.44,"B9V            ","B9","V         ",33.440739200000003,57.5136672,1.5600000000000005]
["V353 Per","Var","bC*","","",33.465965670000003,"2 13 51.8",53.914592399999997,"+53 54 52.53",8.86,8.8800000000000008,"B0.5IV         ","B0","IV        ",33.465965670000003,53.914592399999997,2.1199999999999992]
["BD+54 490                ",{"$f":"IF(LEFT(A315,2)=\"V*\",\"var\",\"\")","v":""},"*  ","","",33.583795000000002,"2 14 20.1",55.059333899999999," 55 3 33.6",9.59,9.5299999999999994,"B1V            ","B1","V         ",33.583795000000002,55.059333899999999,1.4700000000000006]
["HD 13541","","*iC",null,"",33.605378999999999,"2 14 25.2",60.489614000000003,"+60 29 22.61",9.93,9.6199999999999992,"B7V            ","B7","V         ",33.605378999999999,60.489614000000003,1.3800000000000008]
["55 Cas","","*  ",null,"",33.621226819999997,"2 14 29",66.524426820000002,"+66 31 27.93",6.7,6.07,"B9V+...        ","B9","V+...     ",33.621226819999997,66.524426820000002,4.93]
["HD 13621                 ",{"$f":"IF(LEFT(A318,2)=\"V*\",\"var\",\"\")","v":""},"*  ","","",33.637370949999998,"2 14 32.9",55.317132530000002," 55 19 1.67",8.1300000000000008,8.1300000000000008,"B1V            ","B1","V         ",33.637370949999998,55.317132530000002,2.8699999999999992]
["BD+29 376B","","*i*",null,"",33.677613000000001,"2 14 42.6",30.395527999999999,"+30 23 43.9",7.9180000000000001,7.9009999999999998,"B8V            ","B8","V         ",33.677613000000001,30.395527999999999,3.0990000000000002]
["HD 13661","","Be*","","Be",33.721289779999999,"2 14 53.1",54.531719379999998,"+54 31 54.18",7.83,7.86,"B2IV-Ve        ","B2","IV-Ve     ",33.721289779999999,54.531719379999998,3.1399999999999997]
["BD+57 522B","","*i*",null,"",33.725308300000002,"2 14 54",58.489220799999998,"+58 29 21.19",9.6,9.39,"B9V            ","B9","V         ",33.725308300000002,58.489220799999998,1.6099999999999994]
["HD 13633","","*i*",null,"",33.737754199999998,"2 14 57",58.490545599999997,"+58 29 25.96",7.98,7.86,"B7III          ",{"$f":"+LEFT(L322,2)","v":"B7"},{"$f":"+IF(MID(L322,3,1)=\".\",MID(L322,5,10),MID(L322,3,10))","v":"III       "},33.737754199999998,58.490545599999997,{"$f":"11-K322","v":3.1399999999999997}]
["HD 13669","","Be*","","Be",33.760864640000001,"2 15 2.6",55.793219090000001,"+55 47 35.58",8.25,7.9,"B3IV-V         ","B3","IV-V      ",{"$f":"+F323","v":33.760864640000001},{"$f":"+H323","v":55.793219090000001},3.0999999999999996]
["HD 13643","","*  ",null,"",33.783702099999999,"2 15 8",59.503309700000003,"+59 30 11.91",9.44,9.1,"B9V            ","B9","V         ",33.783702099999999,59.503309700000003,1.9000000000000004]
["HD 13590","","Be*","","Be",33.804040980000003,"2 15 12.9",64.024450459999997,"+64 1 28.02",8.25,7.9,"B2III          ","B2","III       ",33.804040980000003,64.024450459999997,3.0999999999999996]
["HD 13716","","*  ","","",33.914202369999998,"2 15 39.4",57.763315990000002,"+57 45 47.93",8.5299999999999994,8.3000000000000007,"B0.5III        ","B0","III       ",33.914202369999998,57.763315990000002,2.6999999999999993]
["HD 13736","","*  ",null,"",33.931514999999997,"2 15 43.5",56.130728300000001,"+56 7 50.62",9.44,9.32,"B9V            ","B9","V         ",33.931514999999997,56.130728300000001,1.6799999999999997]
["HD 13758                 ",{"$f":"IF(LEFT(A328,2)=\"V*\",\"var\",\"\")","v":""},"Be*","","Be",34.018448300000003,"2 16 4.4",57.7448914," 57 44 41.6",9.39,9.14,"B1V            ","B1","V         ",34.018448300000003,57.7448914,1.8599999999999994]
["HD 13772","","*  ",null,"",34.055166700000001,"2 16 13.2",58.408686099999997,"+58 24 31.26",8.7200000000000006,8.6,"B6IV           ","B6","IV        ",34.055166700000001,58.408686099999997,2.4000000000000004]
["HD 13757","","*iC",null,"",34.07335638,"2 16 17.6",60.719236299999999,"+60 43 9.25",8.6300000000000008,8.5,"B9V            ","B9","V         ",34.07335638,60.719236299999999,2.5]
["HD 13867","","Be*",null,"Be",34.149980069999998,"2 16 35.9",49.819872029999999,"+49 49 11.53",7.72,7.71,"B5Ve...         ","B5","Ve...     ",34.149980069999998,49.819872029999999,3.29]
["HD 13867","","Be*",null,"Be",34.149980069999998,"2 16 35.9",49.819872029999999,"+49 49 11.53",7.72,7.71,"B5Ve...         ","B5","Ve...     ",34.149980069999998,49.819872029999999,3.29]
["V473 Per","Var","bC*","","",34.163408820000001,"2 16 39.2",56.737797899999997,"+56 44 16.07",8.32,8.26,"B0IIIp         ","B0","IIIp      ",34.163408820000001,56.737797899999997,2.74]
["HD 13799","","*  ",null,"",34.198631200000001,"2 16 47.6",62.950421400000003,"+62 57 1.51",8.9700000000000006,8.75,"B6III          ","B6","III       ",34.198631200000001,62.950421400000003,2.25]
["HD 13798","","*  ",null,"",34.235468480000002,"2 16 56.5",63.373624120000002,"+63 22 25.04",8.7899999999999991,8.74,"B8V            ","B8","V         ",34.235468480000002,63.373624120000002,2.2599999999999998]
["V356 Per","Var","bC*","","",34.240460400000003,"2 16 57.7",57.130193300000002,"+57 7 48.69",9.39,9.1999999999999993,"B0.5IIIn       ","B0","IIIn      ",34.240460400000003,57.130193300000002,1.8000000000000007]
["HD 13890                 ",{"$f":"IF(LEFT(A337,2)=\"V*\",\"var\",\"\")","v":""},"Be*","","Be",34.284263699999997,"2 17 8.2",56.769746099999999," 56 46 11.08",8.64,8.5,"B1III          ","B1","III       ",34.284263699999997,56.769746099999999,2.5]
["HD 13900                 ",{"$f":"IF(LEFT(A338,2)=\"V*\",\"var\",\"\")","v":""},"Be*","","Be",34.314863699999997,"2 17 15.5",56.898012199999997," 56 53 52.84",9.3800000000000008,9.33,"B1IV           ","B1","IV        ",34.314863699999997,56.898012199999997,1.67]
["HD 13910","","*iC",null,"",34.366869600000001,"2 17 28",57.365631700000002,"+57 21 56.27",8.23,8.16,"B9V            ","B9","V         ",34.366869600000001,57.365631700000002,2.84]
["BD+56 482                ",{"$f":"IF(LEFT(A340,2)=\"V*\",\"var\",\"\")","v":""},"*iC","","",34.413040799999997,"2 17 39.1",57.199360800000001," 57 11 57.69",9.68,9.44,"B1III:p        ","B1","III:p     ",34.413040799999997,57.199360800000001,1.5600000000000005]
["BD+56 484                ",{"$f":"IF(LEFT(A341,2)=\"V*\",\"var\",\"\")","v":""},"Be*","","Be",34.436079599999999,"2 17 44.6",56.899989400000003," 56 53 59.96",9.8800000000000008,9.57,"B1IIIe         ","B1","IIIe      ",34.436079599999999,56.899989400000003,1.4299999999999997]
["HD 13969                 ",{"$f":"IF(LEFT(A342,2)=\"V*\",\"var\",\"\")","v":""},"*iC","","",34.457701700000001,"2 17 49.8",57.090420799999997," 57 5 25.51",9.1300000000000008,8.9499999999999993,"B1IV           ","B1","IV        ",34.457701700000001,57.090420799999997,2.0500000000000007]
["HD 14014","","*  ","","",34.500093300000003,"2 18 0",56.232570600000003,"+56 13 57.25",8.9499999999999993,8.86,"B0.5V          ","B0","V         ",34.500093300000003,56.232570600000003,2.1400000000000006]
["HD 13968","","*  ","","",34.509016699999997,"2 18 2.1",58.377129400000001,"+58 22 37.66",9.6300000000000008,9.48,"B9V            ","B9","V         ",34.509016699999997,58.377129400000001,1.5199999999999996]
["BD+59 456","","*iC","","",34.5573883,"2 18 13.7",59.8020736,"+59 48 7.46",10.39,9.98,"B0.5V          ","B0","V         ",34.5573883,59.8020736,1.0199999999999996]
["BD+56 493                ",{"$f":"IF(LEFT(A346,2)=\"V*\",\"var\",\"\")","v":""},"Be*","","Be",34.57647,"2 18 18.3",56.8506322," 56 51 2.27",9.9499999999999993,9.77,"B1V:pe...      ","B1","V:pe...   ",34.57647,56.8506322,1.2300000000000004]
["BD+56 497","","*iC",null,"",34.595759200000003,"2 18 22.9",57.039270600000002,"+57 2 21.37",10.35,9.09,"B8V            ","B8","V         ",34.595759200000003,57.039270600000002,1.9100000000000001]
["BD+56 502                ",{"$f":"IF(LEFT(A348,2)=\"V*\",\"var\",\"\")","v":""},"Be*","","Be",34.636667000000003,"2 18 32.8",57.211058000000001," 57 12 39.8",9.58,9.2799999999999994,"B1V            ","B1","V         ",34.636667000000003,57.211058000000001,1.7200000000000006]
["HD 14093","","*  ",null,"",34.662286999999999,"2 18 38.9",56.376269000000001,"+56 22 34.56",8.82,8.68,"B9III          ","B9","III       ",34.662286999999999,56.376269000000001,2.3200000000000003]
["BD+56 504","","*iC",null,"",34.668011999999997,"2 18 40.3",57.100847000000002,"+57 6 3.04",9.7260000000000009,9.4329999999999998,"B5V             ","B5","V         ",34.668011999999997,57.100847000000002,1.5670000000000002]
["BD+56 504","","*iC",null,"",34.668011999999997,"2 18 40.3",57.100847000000002,"+57 6 3.04",9.7260000000000009,9.4329999999999998,"B5V             ","B5","V         ",34.668011999999997,57.100847000000002,1.5670000000000002]
["HD 14092                 ",{"$f":"IF(LEFT(A352,2)=\"V*\",\"var\",\"\")","v":""},"*iC","","",34.674514600000002,"2 18 41.8",56.761312199999999," 56 45 40.72",9.44,9.2799999999999994,"B1V            ","B1","V         ",34.674514600000002,56.761312199999999,1.7200000000000006]
["V665 Per","Var","bC*","","",34.700069999999997,"2 18 48",57.285528100000001,"+57 17 7.9",9.7200000000000006,9.43,"B2V            ","B2","V         ",34.700069999999997,57.285528100000001,1.5700000000000003]
["BD+56 513                ",{"$f":"IF(LEFT(A354,2)=\"V*\",\"var\",\"\")","v":""},"*iC","","",34.705962,"2 18 49.4",57.097292000000003," 57 5 50.25",10.265000000000001,9.9429999999999996,"B1V            ","B1","V         ",34.705962,57.097292000000003,1.0570000000000004]
["BD+56 515","","Be*","","Be",34.724404,"2 18 53.8",57.139519,"+57 8 22.26",9.8360000000000003,9.4960000000000004,"B0.5Vn         ","B0","Vn        ",34.724404,57.139519,1.5039999999999996]
["HD 14061","","*iC",null,"",34.738511189999997,"2 18 57.2",61.145925589999997,"+61 8 45.33",9.65,9.39,"B9V            ","B9","V         ",34.738511189999997,61.145925589999997,1.6099999999999994]
["BD+56 519","","*iC","","",34.746029,"2 18 59",57.145256000000003,"+57 8 42.92",9.9979999999999993,9.67,"B1.5V          ","B1","V         ",34.746029,57.145256000000003,1.33]
["V* V614 Per              ",{"$f":"IF(LEFT(A358,2)=\"V*\",\"var\",\"\")","v":"var"},"bC*","","",34.750853999999997,"2 19 0.2",57.145660999999997," 57 8 44.37",10.243,9.9019999999999992,"B1Vn           ","B1","Vn        ",34.750853999999997,57.145660999999997,1.0980000000000008]
["BD+56 524                ",{"$f":"IF(LEFT(A359,2)=\"V*\",\"var\",\"\")","v":""},"*iC","","",34.776820999999998,"2 19 6.4",57.126393999999998," 57 7 35.01",10.114000000000001,9.7620000000000005,"B1Vn           ","B1","Vn        ",34.776820999999998,57.126393999999998,1.2379999999999995]
["BD+56 525","","*iC","","",34.788662000000002,"2 19 9.2",57.135083000000002,"+57 8 6.29",9.6300000000000008,9.2479999999999993,"B0.5V          ","B0","V         ",34.788662000000002,57.135083000000002,1.7520000000000007]
["BD+56 526                ",{"$f":"IF(LEFT(A361,2)=\"V*\",\"var\",\"\")","v":""},"*iC","","",34.792746000000001,"2 19 10.2",57.127296999999999," 57 7 38.26",9.3840000000000003,8.9819999999999993,"B1III          ","B1","III       ",34.792746000000001,57.127296999999999,2.0180000000000007]
["BD+56 527                ",{"$f":"IF(LEFT(A362,2)=\"V*\",\"var\",\"\")","v":""},"*iC","","",34.793571,"2 19 10.4",57.130718999999999," 57 7 50.58",8.8179999999999996,7.7560000000000002,"B1IV           ","B1","IV        ",34.793571,57.130718999999999,3.2439999999999998]
["BD+56 534","","Be*","","Be",34.860529,"2 19 26.5",57.078394000000003,"+57 4 42.21",10.02,9.58,"B3Ve           ","B3","Ve        ",34.860529,57.078394000000003,1.42]
["HR 677","","*  ",null,"",34.905333749999997,"2 19 37.2",39.834945529999999,"+39 50 5.8",6.5339999999999998,6.6210000000000004,"B8V            ","B8","V         ",34.905333749999997,39.834945529999999,4.3789999999999996]
["HD 14220","","*  ","","",34.907462430000002,"2 19 37.7",52.561383210000002,"+52 33 40.97",7.125,7.1879999999999997,"B2V            ","B2","V         ",34.907462430000002,52.561383210000002,3.8120000000000003]
["BD+56 538","","*iC","","",34.916936999999997,"2 19 40",57.092030999999999,"+57 5 31.31",10,9.9649999999999999,"B2V            ","B2","V         ",34.916936999999997,57.092030999999999,1.0350000000000001]
["HD 14210","","*iC",null,"",34.9838813,"2 19 56.1",57.318088490000001,"+57 19 5.11",8.48,8.25,"B9III          ","B9","III       ",34.9838813,57.318088490000001,2.75]
["V359 Per              ","var","bC*","","",35.0655213,"2 20 15.7",57.098600300000001," 57 5 54.96",9.42,9.09,"B1IV           ","B1","IV        ",35.0655213,57.098600300000001,1.9100000000000001]
["HD 14302                 ",{"$f":"IF(LEFT(A369,2)=\"V*\",\"var\",\"\")","v":""},"*  ","","",35.142200000000003,"2 20 34.1",56.329948600000002," 56 19 47.81",8.81,8.64,"B1II-III       ","B1","II-III    ",35.142200000000003,56.329948600000002,2.3599999999999994]
["BD+56 548","","Be*","","Be",35.162616999999997,"2 20 39",57.312080999999999,"+57 18 43.49",9.8000000000000007,9.65,"B1.5IIIe       ","B1","IIIe      ",35.162616999999997,57.312080999999999,1.3499999999999996]
["HD 14301","","*  ",null,"",35.171458000000001,"2 20 41.1",58.158921999999997,"+58 9 32.11",9.56,9.3699999999999992,"B7IV           ","B7","IV        ",35.171458000000001,58.158921999999997,1.6300000000000008]
["HR 679","","*  ",null,"",35.172972790000003,"2 20 41.5",47.310804070000003,"+47 18 38.89",6.069,6.1630000000000003,"B5V             ","B5","V         ",35.172972790000003,47.310804070000003,4.8369999999999997]
["HR 679","","*  ",null,"",35.172972790000003,"2 20 41.5",47.310804070000003,"+47 18 38.89",6.069,6.1630000000000003,"B5V             ","B5","V         ",35.172972790000003,47.310804070000003,4.8369999999999997]
["HD 14299","","*iC",null,"",35.202396,"2 20 48.5",59.606431000000001,"+59 36 23.15",8.6999999999999993,8.4499999999999993,"B8III          ","B8","III       ",35.202396,59.606431000000001,2.5500000000000007]
["HD 14331","","*  ","","",35.214190729999999,"2 20 51.4",55.8253761,"+55 49 31.35",8.57,8.4700000000000006,"B0III          ","B0","III       ",35.214190729999999,55.8253761,2.5299999999999994]
["BD+56 549                ",{"$f":"IF(LEFT(A376,2)=\"V*\",\"var\",\"\")","v":""},"*iC","","",35.219619999999999,"2 20 52.7",57.457282200000002," 57 27 26.21",10.23,9.9700000000000006,"B1V            ","B1","V         ",35.219619999999999,57.457282200000002,1.0299999999999994]
["HD 14321                 ",{"$f":"IF(LEFT(A377,2)=\"V*\",\"var\",\"\")","v":""},"*iC","","",35.220327900000001,"2 20 52.8",56.9257603," 56 55 32.73",9.57,9.34,"B1IV           ","B1","IV        ",35.220327900000001,56.9257603,1.6600000000000001]
["PZ And","Var","a2*",null,"",35.242533850000001,"2 20 58.2",50.151464079999997,"+50 9 5.27",5.46,5.59,"B9sp...        ","B9","sp...     ",35.242533850000001,50.151464079999997,5.41]
["BD+56 559                ",{"$f":"IF(LEFT(A379,2)=\"V*\",\"var\",\"\")","v":""},"Be*","","Be",35.325277499999999,"2 21 18",57.306138300000001," 57 18 22.09",10.33,9.9600000000000009,"B1IIIe         ","B1","IIIe      ",35.325277499999999,57.306138300000001,1.0399999999999991]
["BD+56 563                ",{"$f":"IF(LEFT(A380,2)=\"V*\",\"var\",\"\")","v":""},"Be*","","Be",35.430804000000002,"2 21 43.3",57.125788999999997," 57 7 32.84",9.77,9.4499999999999993,"B1IIIe         ","B1","IIIe      ",35.430804000000002,57.125788999999997,1.5500000000000007]
["BD+56 566                ",{"$f":"IF(LEFT(A381,2)=\"V*\",\"var\",\"\")","v":""},"Be*","","Be",35.470537,"2 21 52.9",57.166378000000002," 57 9 58.96",10.26,9.86,"B1Ve           ","B1","Ve        ",35.470537,57.166378000000002,1.1400000000000006]
["BD+56 571                ",{"$f":"IF(LEFT(A382,2)=\"V*\",\"var\",\"\")","v":""},"V* ","","",35.503875000000001,"2 22 0.9",57.137300000000003," 57 8 14.28",9.69,9.36,"B1V            ","B1","V         ",35.503875000000001,57.137300000000003,1.6400000000000006]
["V619 Per","Var","bC*","","",35.511583000000002,"2 22 2.7",57.140307999999997,"+57 8 25.1",10.220000000000001,9.9,"B2III          ","B2","III       ",35.511583000000002,57.140307999999997,1.0999999999999996]
["BD+56 573","","Be*","","Be",35.526499999999999,"2 22 6.3",57.090291999999998,"+57 5 25.05",10.06,9.66,"B2III-IVe      ","B2","III-IVe   ",35.526499999999999,57.090291999999998,1.3399999999999999]
["BD+56 574                ",{"$f":"IF(LEFT(A385,2)=\"V*\",\"var\",\"\")","v":""},"V* ","","",35.530766999999997,"2 22 7.3",57.111978000000001," 57 6 43.12",8.83,8.5299999999999994,"B1III          ","B1","III       ",35.530766999999997,57.111978000000001,2.4700000000000006]
["V595 Per","Var","bC*","","",35.535862000000002,"2 22 8.6",57.124547,"+57 7 28.36",9.3699999999999992,9.08,"B0.5IV         ",{"$f":"+LEFT(L386,2)","v":"B0"},{"$f":"+IF(MID(L386,3,1)=\".\",MID(L386,5,10),MID(L386,3,10))","v":"IV        "},35.535862000000002,57.124547,{"$f":"11-K386","v":1.92}]
["V621 Per","Var","Al*","","",35.540419999999997,"2 22 9.7",57.117310000000003,"+57 7 2.31",9.68,9.3800000000000008,"B2III          ","B2","III       ",{"$f":"+F387","v":35.540419999999997},{"$f":"+H387","v":57.117310000000003},1.6199999999999992]
["HD 14476","","*iC","","",35.570685400000002,"2 22 16.9",57.271928899999999,"+57 16 18.94",9.1300000000000008,8.85,"B0.5III        ","B0","III       ",35.570685400000002,57.271928899999999,2.1500000000000004]
["V622 Per","Var","El*","","",35.573708000000003,"2 22 17.6",57.123519000000002,"+57 7 24.66",9.57,9.25,"B2III          ","B2","III       ",35.573708000000003,57.123519000000002,1.75]
["BD+56 582                ",{"$f":"IF(LEFT(A390,2)=\"V*\",\"var\",\"\")","v":""},"Be*","","Be",35.594774999999998,"2 22 22.7",57.284724199999999," 57 17 5",10.06,9.65,"B1III          ","B1","III       ",35.594774999999998,57.284724199999999,1.3499999999999996]
["HD 14501","","*  ","","",35.6346463,"2 22 32.3",58.153733099999997,"+58 9 13.43",9.74,9.4,"B3V:n          ","B3","V:n       ",35.6346463,58.153733099999997,1.5999999999999996]
["BD+56 586                ",{"$f":"IF(LEFT(A392,2)=\"V*\",\"var\",\"\")","v":""},"V* ","","",35.651308,"2 22 36.3",57.081764," 57 4 54.35",10.19,9.94,"B1V            ","B1","V         ",35.651308,57.081764,1.0600000000000005]
["V* V360 Per              ",{"$f":"IF(LEFT(A393,2)=\"V*\",\"var\",\"\")","v":"var"},"bC*","","",35.707690800000002,"2 22 49.8",57.511698099999997," 57 30 42.11",9.84,9.5500000000000007,"B1III          ","B1","III       ",35.707690800000002,57.511698099999997,1.4499999999999993]
["HD 14581","","*iC",null,"",35.849743349999997,"2 23 23.9",56.854238410000001,"+56 51 15.25",8.6999999999999993,8.5500000000000007,"B7III          ","B7","III       ",35.849743349999997,56.854238410000001,2.4499999999999993]
["BD+58 458                ",{"$f":"IF(LEFT(A395,2)=\"V*\",\"var\",\"\")","v":""},"Be*","","Be",35.873115800000001,"2 23 29.5",58.963497199999999," 58 57 48.58",10.26,9.86,"B1pe           ","B1","pe        ",35.873115800000001,58.963497199999999,1.1400000000000006]
["HD 14605","","Be*","","Be",35.897666700000002,"2 23 35.4",56.5744069,"+56 34 27.86",9.6999999999999993,9.58,"B0.5Vpe        ","B0","Vpe       ",35.897666700000002,56.5744069,1.42]
["HD 14557","","*  ",null,"",35.93257638,"2 23 43.8",62.416808590000002,"+62 25 0.51",9.31,9.08,"B8V            ","B8","V         ",35.93257638,62.416808590000002,1.92]
["HD 14645","","*  ","","",36.004714200000002,"2 24 1.1",58.323861399999998,"+58 19 25.9",9.7899999999999991,9.43,"B0IV:nn        ","B0","IV:nn     ",36.004714200000002,58.323861399999998,1.5700000000000003]
["HD 14644","","*iC",null,"",36.031849200000003,"2 24 7.6",59.172986100000003,"+59 10 22.74",9.2799999999999994,9.0299999999999994,"B9III          ","B9","III       ",36.031849200000003,59.172986100000003,1.9700000000000006]
["HD 14707","","V* ","","",36.117015000000002,"2 24 28",58.300706400000003,"+58 18 2.54",10.46,9.94,"B0.5IIIv       ","B0","IIIv      ",36.117015000000002,58.300706400000003,1.0600000000000005]
["HD 14734","","*  ","","",36.163504000000003,"2 24 39.2",57.216566999999998,"+57 12 59.64",9.6300000000000008,9.5299999999999994,"B0.5V          ","B0","V         ",36.163504000000003,57.216566999999998,1.4700000000000006]
["BD+62 390","","*iC",null,"",36.165469600000002,"2 24 39.7",62.890280599999997,"+62 53 25.01",9.6199999999999992,9.3000000000000007,"B7V            ","B7","V         ",36.165469600000002,62.890280599999997,1.6999999999999993]
["ksi Ari","","SB*",null,"",36.204402299999998,"2 24 49",10.610562099999999,"+10 36 38.02",5.3719999999999999,5.4729999999999999,"B7IV           ","B7","IV        ",36.204402299999998,10.610562099999999,5.5270000000000001]
["HD 14795","","*iC",null,"",36.360984620000004,"2 25 26.6",60.005343879999998,"+60 0 19.23",7.66,7.65,"B7V            ","B7","V         ",36.360984620000004,60.005343879999998,3.3499999999999996]
["V559 Cas","Var","Al*",null,"",36.417115449999997,"2 25 40.1",61.549663209999999,"+61 32 58.78",7.2119999999999997,7.016,"B8V            ","B8","V         ",36.417115449999997,61.549663209999999,3.984]
["DM Per","Var","Al*",null,"",36.491699050000001,"2 25 58",56.102779699999999,"+56 6 10",8.0299999999999994,7.95,"B5V+A5III       ","B5","V+A5III   ",36.491699050000001,56.102779699999999,3.05]
["DM Per","Var","Al*",null,"",36.491699050000001,"2 25 58",56.102779699999999,"+56 6 10",8.0299999999999994,7.95,"B5V+A5III       ","B5","V+A5III   ",36.491699050000001,56.102779699999999,3.05]
["HD 14900","","*i*",null,"",36.567712839999999,"2 26 16.2",57.068590350000001,"+57 4 6.92",9.0299999999999994,8.84,"B9V            ","B9","V         ",36.567712839999999,57.068590350000001,2.16]
["BD+56 624","","Be*","","Be",36.669002900000002,"2 26 40.5",57.092521900000001,"+57 5 33.07",10.029999999999999,9.7799999999999994,"B3IIIe         ","B3","IIIe      ",36.669002900000002,57.092521900000001,1.2200000000000006]
["BD+61 412","","*iC",null,"",36.8022846,"2 27 12.5",62.200646900000002,"+62 12 2.32",9.4,9.0500000000000007,"B6V            ","B6","V         ",36.8022846,62.200646900000002,1.9499999999999993]
["HD 15011","","*  ",null,"",36.805315800000002,"2 27 13.2",56.710864999999998,"+56 42 39.11",9.59,9.4600000000000009,"B8III          ","B8","III       ",36.805315800000002,56.710864999999998,1.5399999999999991]
["HD 15137","","*  ","","",36.999215220000004,"2 27 59.8",52.549331199999997,"+52 32 57.59",7.92,7.86,"O9.5II-III(n)    ","O9","II-III(n) ",36.999215220000004,52.549331199999997,3.1399999999999997]
["73 Cet","","*  ",null,"",37.039761079999998,"2 28 9.5",8.4600557500000004,"+8 27 36.2",4.242,4.2770000000000001,"B9III          ","B9","III       ",37.039761079999998,8.4600557500000004,6.7229999999999999]
["HD 15124","","*  ",null,"",37.04326992,"2 28 10.3",57.274802119999997,"+57 16 29.28",8.26,8.0500000000000007,"B5III           ","B5","III       ",37.04326992,57.274802119999997,2.9499999999999993]
["HD 15124","","*  ",null,"",37.04326992,"2 28 10.3",57.274802119999997,"+57 16 29.28",8.26,8.0500000000000007,"B5III           ","B5","III       ",37.04326992,57.274802119999997,2.9499999999999993]
["BD+59 494","","*iC",null,"",37.175009600000003,"2 28 42",60.375726100000001,"+60 22 32.61",10.220000000000001,9.99,"B9Vp           ","B9","Vp        ",37.175009600000003,60.375726100000001,1.0099999999999998]
["TYC 3699-1878-1          ",{"$f":"IF(LEFT(A417,2)=\"V*\",\"var\",\"\")","v":""},"*  ","","",37.411358,"2 29 38.7",58.225116999999997," 58 13 30.42",10.34,9.86,"B1III          ","B1","III       ",37.411358,58.225116999999997,1.1400000000000006]
["HD 15238","","Be*",null,"Be",37.431399140000003,"2 29 43.5",60.67737151,"+60 40 38.53",8.73,8.49,"B5V             ","B5","V         ",37.431399140000003,60.67737151,2.5099999999999998]
["HD 15238","","Be*",null,"Be",37.431399140000003,"2 29 43.5",60.67737151,"+60 40 38.53",8.73,8.49,"B5V             ","B5","V         ",37.431399140000003,60.67737151,2.5099999999999998]
["HD 15325                 ",{"$f":"IF(LEFT(A420,2)=\"V*\",\"var\",\"\")","v":""},"*  ","","",37.510310799999999,"2 30 2.4",57.248906900000001," 57 14 56.06",8.9499999999999993,8.6300000000000008,"B1IV           ","B1","IV        ",37.510310799999999,57.248906900000001,2.3699999999999992]
["HD 15450                 ",{"$f":"IF(LEFT(A421,2)=\"V*\",\"var\",\"\")","v":""},"Be*","","Be",37.83140942,"2 31 19.5",56.897826330000001," 56 53 52.17",9.2799999999999994,9,"B1IIIe         ","B1","IIIe      ",37.83140942,56.897826330000001,2]
["HD 15548                 ",{"$f":"IF(LEFT(A422,2)=\"V*\",\"var\",\"\")","v":""},"*i*","","",38.020994139999999,"2 32 5",56.666214150000002," 56 39 58.37",9.44,9.2100000000000009,"B1V            ","B1","V         ",38.020994139999999,56.666214150000002,1.7899999999999991]
["2MASS J02321086+6133080","","Y*O","","",38.045235269999999,"2 32 10.8",61.552208469999997,"+61 33 7.95",10.47,9.94,"O9.5V            ","O9","V         ",38.045235269999999,61.552208469999997,1.0600000000000005]
["BD+60 503","","*iC","","",38.179318299999998,"2 32 43",60.953657499999998,"+60 57 13.16",10.62,9.98,"B1.5V          ","B1","V         ",38.179318299999998,60.953657499999998,1.0199999999999996]
["HD 15622","","*  ","","",38.192683000000002,"2 32 46.2",56.807481000000003,"+56 48 26.93",9.7200000000000006,9.49,"B3III          ","B3","III       ",38.192683000000002,56.807481000000003,1.5099999999999998]
["HD 15642","","*  ","","",38.234933810000001,"2 32 56.3",55.327516840000001,"+55 19 39.06",8.56,8.5500000000000007,"O9.5III:n        ","O9","III:n     ",38.234933810000001,55.327516840000001,2.4499999999999993]
["Cl* NGC 957 HOAG 4       ",{"$f":"IF(LEFT(A427,2)=\"V*\",\"var\",\"\")","v":""},"*iC","","",38.39067,"2 33 33.7",57.543579999999999," 57 32 36.88",10.44,9.9,"B1V            ","B1","V         ",38.39067,57.543579999999999,1.0999999999999996]
["V362 Per","Var","bC*","","",38.547693979999998,"2 34 11.4",58.405493219999997,"+58 24 19.77",9.17,8.77,"B0III          ","B0","III       ",38.547693979999998,58.405493219999997,2.2300000000000004]
["BD+58 488","","*iC","","",38.67500776,"2 34 42",59.507443680000002,"+59 30 26.79",10.31,9.75,"B0.5V          ","B0","V         ",38.67500776,59.507443680000002,1.25]
["HR 746","","*i*",null,"",38.866254689999998,"2 35 27.9",39.664379269999998,"+39 39 51.76",6.2649999999999997,6.3440000000000003,"B9mnp...       ","B9","mnp...    ",38.866254689999998,39.664379269999998,4.6559999999999997]
["HD 236971                ",{"$f":"IF(LEFT(A431,2)=\"V*\",\"var\",\"\")","v":""},"*  ","","",38.907648299999998,"2 35 37.8",57.4870217," 57 29 13.27",9.9700000000000006,9.58,"B1IV           ","B1","IV        ",38.907648299999998,57.4870217,1.42]
["BD+57 593                ",{"$f":"IF(LEFT(A432,2)=\"V*\",\"var\",\"\")","v":""},"*  ","","",38.966790799999998,"2 35 52",57.7894553," 57 47 22.03",10.33,9.9,"B1III          ","B1","III       ",38.966790799999998,57.7894553,1.0999999999999996]
["HD 15964","","*  ",null,"",39.056622339999997,"2 36 13.5",57.728089769999997,"+57 43 41.12",8.94,8.86,"B9V            ","B9","V         ",39.056622339999997,57.728089769999997,2.1400000000000006]
["HD 15979","","*iC",null,"",39.101553799999998,"2 36 24.3",59.074691700000002,"+59 4 28.89",9.52,9.32,"B9V            ","B9","V         ",39.101553799999998,59.074691700000002,1.6799999999999997]
["HD 16012","","*  ",null,"",39.14832655,"2 36 35.5",57.720620179999997,"+57 43 14.23",8.52,8.4700000000000006,"B9III          ","B9","III       ",39.14832655,57.720620179999997,2.5299999999999994]
["HD 16040","","*iC",null,"",39.153023779999998,"2 36 36.7",55.925368689999999,"+55 55 31.32",8.76,8.6199999999999992,"B9III          ","B9","III       ",39.153023779999998,55.925368689999999,2.3800000000000008]
["HD 16025","","*  ",null,"",39.196345999999998,"2 36 47.1",58.120100000000001,"+58 7 12.36",9.1,8.99,"B9V            ","B9","V         ",39.196345999999998,58.120100000000001,2.0099999999999998]
["V791 Cas","Var","bL*",null,"",39.230407290000002,"2 36 55.2",59.88360857,"+59 53 0.99",8.0299999999999994,7.78,"B8V            ","B8","V         ",39.230407290000002,59.88360857,3.2199999999999998]
["HD 16081","","*iC",null,"",39.255810799999999,"2 37 1.3",55.748018899999998,"+55 44 52.86",9.07,8.91,"B7III          ","B7","III       ",39.255810799999999,55.748018899999998,2.09]
["HR 760","","*  ",null,"",39.336835890000003,"2 37 20.8",39.896098780000003,"+39 53 45.95",6.4180000000000001,6.5250000000000004,"B5V             ","B5","V         ",39.336835890000003,39.896098780000003,4.4749999999999996]
["HR 760","","*  ",null,"",39.336835890000003,"2 37 20.8",39.896098780000003,"+39 53 45.95",6.4180000000000001,6.5250000000000004,"B5V             ","B5","V         ",39.336835890000003,39.896098780000003,4.4749999999999996]
["HD 16159","","*iC",null,"",39.43478399,"2 37 44.3",55.972991440000001,"+55 58 22.76",8.7899999999999991,8.58,"B9III          ","B9","III       ",39.43478399,55.972991440000001,2.42]
["HD 16218","","*i*",null,"",39.743097599999999,"2 38 58.3",62.591508810000001,"+62 35 29.43",6.6360000000000001,6.6550000000000002,"B9V            ","B9","V         ",39.743097599999999,62.591508810000001,4.3449999999999998]
["BD+61 446","","*iC",null,"",39.81765,"2 39 16.2",61.710935999999997,"+61 42 39.36",9.4700000000000006,9.14,"B9V            ","B9","V         ",39.81765,61.710935999999997,1.8599999999999994]
["del Cet","Var","bC*","","",39.870649120000003,"2 39 28.9",0.32850959000000002,"+0 19 42.63",3.85,4.07,"B2IV           ","B2","IV        ",39.870649120000003,0.32850959000000002,6.93]
["HD 16394","","*iC",null,"",40.032758000000001,"2 40 7.8",58.659647,"+58 39 34.72",9.26,9.0299999999999994,"B9V            ","B9","V         ",40.032758000000001,58.659647,1.9700000000000006]
["HD 16485","","*  ",null,"",40.087255419999998,"2 40 20.9",49.560254860000001,"+49 33 36.91",6.67,6.59,"B9V            ","B9","V         ",40.087255419999998,49.560254860000001,4.41]
["HD 16449","","*  ",null,"",40.153910009999997,"2 40 36.9",56.84390312,"+56 50 38.05",9.14,9.01,"B9V            ","B9","V         ",40.153910009999997,56.84390312,1.9900000000000002]
["HD 16494","","*  ",null,"",40.260203910000001,"2 41 2.4",57.810820509999999,"+57 48 38.95",8.9,8.82,"B9III          ","B9","III       ",40.260203910000001,57.810820509999999,2.1799999999999997]
["HD 16524","","*  ",null,"",40.282043139999999,"2 41 7.6",56.270102119999997,"+56 16 12.36",7.44,7.46,"B6V            ",{"$f":"+LEFT(L450,2)","v":"B6"},{"$f":"+IF(MID(L450,3,1)=\".\",MID(L450,5,10),MID(L450,3,10))","v":"V         "},40.282043139999999,56.270102119999997,{"$f":"11-K450","v":3.54}]
["HD 16507","","*iC",null,"",40.326246470000001,"2 41 18.2",59.714596960000002,"+59 42 52.54",8.9600000000000009,8.49,"B8V            ","B8","V         ",{"$f":"+F451","v":40.326246470000001},{"$f":"+H451","v":59.714596960000002},2.5099999999999998]
["BD+61 456","","*iC",null,"",40.362006639999997,"2 41 26.8",61.71978172,"+61 43 11.21",10.07,9.74,"B9V            ","B9","V         ",40.362006639999997,61.71978172,1.2599999999999998]
["HD 16544","","*  ",null,"",40.370258,"2 41 28.8",58.196047,"+58 11 45.76",9.2899999999999991,9.2100000000000009,"B9V            ","B9","V         ",40.370258,58.196047,1.7899999999999991]
["HD 16655","","*iC",null,"",40.383017479999999,"2 41 31.9",42.594206120000003,"+42 35 39.14",8.5299999999999994,8.5,"B9V            ","B9","V         ",40.383017479999999,42.594206120000003,2.5]
["HD 16679","","*iC",null,"",40.4520275,"2 41 48.4",42.770602500000003,"+42 46 14.16",9.0399999999999991,9.08,"B9V            ","B9","V         ",40.4520275,42.770602500000003,1.92]
["HD 16693","","*i*",null,"",40.486350000000002,"2 41 56.7",42.789774999999999,"+42 47 23.18",8.52,8.52,"B9Vp...        ","B9","Vp...     ",40.486350000000002,42.789774999999999,2.4800000000000004]
["HD 16705","","*i*",null,"",40.493462000000001,"2 41 58.4",42.791769000000002,"+42 47 30.36",7.73,7.73,"B9V            ","B9","V         ",40.493462000000001,42.791769000000002,3.2699999999999996]
["HD 16719","","*i*",null,"",40.524063589999997,"2 42 5.7",42.707414919999998,"+42 42 26.69",8.26,8.2799999999999994,"B8V            ","B8","V         ",40.524063589999997,42.707414919999998,2.7200000000000006]
["HD 16617","","*  ",null,"",40.528601639999998,"2 42 6.8",57.420417409999999,"+57 25 13.5",8.9700000000000006,8.8699999999999992,"B8V            ","B8","V         ",40.528601639999998,57.420417409999999,2.1300000000000008]
["CCDM J02422+4242AB","","** ",null,"",40.554717259999997,"2 42 13.1",42.699216040000003,"+42 41 57.17",8.14,8.14,"B9Vp...        ","B9","Vp...     ",40.554717259999997,42.699216040000003,2.8599999999999994]
["BD+42 597","","*iC",null,"",40.560151699999999,"2 42 14.4",42.866484200000002,"+42 51 59.34",9.3000000000000007,9.24,"B9V            ","B9","V         ",40.560151699999999,42.866484200000002,1.7599999999999998]
["BD+42 601","","*i*",null,"",40.592281700000001,"2 42 22.1",42.760153099999997,"+42 45 36.55",8.86,8.86,"B8V            ","B8","V         ",40.592281700000001,42.760153099999997,2.1400000000000006]
["BD+42 602","","*iC",null,"",40.613595400000001,"2 42 27.2",42.758068899999998,"+42 45 29.04",9.33,9.31,"B9V            ","B9","V         ",40.613595400000001,42.758068899999998,1.6899999999999995]
["HD 16772","","*i*",null,"",40.622853720000002,"2 42 29.4",40.261251199999997,"+40 15 40.5",7.55,7.56,"B9V            ","B9","V         ",40.622853720000002,40.261251199999997,3.4400000000000004]
["BD+60 547","","*iC",null,"",40.630380000000002,"2 42 31.2",61.520029999999998,"+61 31 12.1","     ~",9.5,"B9V            ","B9","V         ",40.630380000000002,61.520029999999998,1.5]
["HD 16782","","*i*",null,"",40.690623299999999,"2 42 45.7",42.820298600000001,"+42 49 13.07",8.24,8.25,"B8V            ","B8","V         ",40.690623299999999,42.820298600000001,2.75]
["11 Per","","*  ",null,"",40.76182618,"2 43 2.8",55.106017860000001,"+55 6 21.66",5.64,5.7480000000000002,"B7IIIp...      ","B7","IIIp...   ",40.76182618,55.106017860000001,5.2519999999999998]
["35 Ari","","*  ",null,"",40.862966040000003,"2 43 27.1",27.707145359999998,"+27 42 25.72",4.5190000000000001,4.6399999999999997,"B3V            ","B3","V         ",40.862966040000003,27.707145359999998,6.36]
["HD 16857","","*iC","","",40.885073300000002,"2 43 32.4",42.621520599999997,"+42 37 17.47",8.89,8.93,"B9V            ","B9","V         ",40.885073300000002,42.621520599999997,2.0700000000000003]
["BD+60 559","","*iC",null,"",41.129300000000001,"2 44 31",60.885089000000001,"+60 53 6.32",9.52,9.25,"B8III          ","B8","III       ",41.129300000000001,60.885089000000001,1.75]
["omi Ari","","*  ",null,"",41.137388190000003,"2 44 32.9",15.31186347,"+15 18 42.7",5.7510000000000003,5.7759999999999998,"B9Vn           ","B9","Vn        ",41.137388190000003,15.31186347,5.2240000000000002]
["RY Per","Var","Al*",null,"",41.425510189999997,"2 45 42.1",48.14386013,"+48 8 37.89",8.69,8.6300000000000008,"B8V+...        ","B8","V+...     ",41.425510189999997,48.14386013,2.3699999999999992]
["BD+61 479","","*iC",null,"",41.649482999999996,"2 46 35.8",61.668036000000001,"+61 40 4.92",10.19,9.99,"B9V            ","B9","V         ",41.649482999999996,61.668036000000001,1.0099999999999998]
["BD+60 564","","*iC",null,"",41.673283300000001,"2 46 41.5",61.457459200000002,"+61 27 26.85",10.029999999999999,9.7899999999999991,"B9V            ","B9","V         ",41.673283300000001,61.457459200000002,1.2100000000000009]
["HD 17259","","*  ",null,"",41.765285599999999,"2 47 3.6",31.395053310000002,"+31 23 42.19",7.75,7.7,"B8V            ","B8","V         ",41.765285599999999,31.395053310000002,3.3]
["HD 17087","","*iC",null,"",41.778257099999998,"2 47 6.7",59.285304400000001,"+59 17 7.09",9.16,8.8699999999999992,"B8III          ","B8","III       ",41.778257099999998,59.285304400000001,2.1300000000000008]
["V* V792 Cas              ",{"$f":"IF(LEFT(A477,2)=\"V*\",\"var\",\"\")","v":"var"},"bC*","","",41.843045310000001,"2 47 22.3",59.286383499999999," 59 17 10.98",9.6300000000000008,9.25,"B1V            ","B1","V         ",41.843045310000001,59.286383499999999,1.75]
["42 Ari","","SB*",null,"",42.323163489999999,"2 49 17.5",17.464310220000002,"+17 27 51.51",5.226,5.3140000000000001,"B6V            ","B6","V         ",42.323163489999999,17.464310220000002,5.6859999999999999]
["CCDM J02499+2715A","","** ",null,"",42.495971830000002,"2 49 59",27.260507230000002,"+27 15 37.82",3.5150000000000001,3.6059999999999999,"B8Vn           ","B8","Vn        ",42.495971830000002,27.260507230000002,7.3940000000000001]
["HD 237007","","*iC","","",42.645407239999997,"2 50 34.8",60.401867920000001,"+60 24 6.72",9.68,9.41,"B0V            ","B0","V         ",42.645407239999997,60.401867920000001,1.5899999999999999]
["V794 Cas","Var","Al*",null,"",42.722924540000001,"2 50 53.5",62.36771023,"+62 22 3.75",8.01,7.87,"B9III          ","B9","III       ",42.722924540000001,62.36771023,3.13]
["sig Ari","","*  ",null,"",42.873275360000001,"2 51 29.5",15.082069430000001,"+15 4 55.44",5.4169999999999998,5.5140000000000002,"B7V            ","B7","V         ",42.873275360000001,15.082069430000001,5.4859999999999998]
["HD 17443","","*iN",null,"",42.886544649999998,"2 51 32.7",67.815043349999996,"+67 48 54.15",9.0399999999999991,8.75,"B9V            ","B9","V         ",42.886544649999998,67.815043349999996,2.25]
["V* TX Cas                ",{"$f":"IF(LEFT(A484,2)=\"V*\",\"var\",\"\")","v":"var"},"bL*","","",43.067468699999999,"2 52 16.1",62.782645600000002," 62 46 57.52",9.6189999999999998,9.33,"B1V            ","B1","V         ",43.067468699999999,62.782645600000002,1.67]
["CCDM J02527+0628AB","","** ",null,"",43.165196530000003,"2 52 39.6",6.47480601,"+6 28 29.3",6.3,7.9,"B9V            ","B9","V         ",43.165196530000003,6.47480601,3.0999999999999996]
["CCDM J02529+5300ABC","","** ",null,"",43.216800540000001,"2 52 52",52.997290829999997,"+52 59 50.24",6.43,6.35,"B8III          ","B8","III       ",43.216800540000001,52.997290829999997,4.6500000000000004]
["V796 Cas","Var","LP*",null,"",43.291045619999998,"2 53 9.8",58.765556590000003,"+58 45 56",8.2799999999999994,8.0299999999999994,"B7III          ","B7","III       ",43.291045619999998,58.765556590000003,2.9700000000000006]
["BD+60 584","","*iC",null,"",43.297377900000001,"2 53 11.3",60.623744199999997,"+60 37 25.47",10.15,9.8699999999999992,"B8V            ","B8","V         ",43.297377900000001,60.623744199999997,1.1300000000000008]
["BD+60 587","","*iC",null,"",43.642535700000003,"2 54 34.2",61.425166900000001,"+61 25 30.6",9.2200000000000006,8.86,"B6III          ","B6","III       ",43.642535700000003,61.425166900000001,2.1400000000000006]
["BD+60 592","","*iC",null,"",44.104258299999998,"2 56 25",61.215154699999999,"+61 12 54.55",9.6300000000000008,9.43,"B9V            ","B9","V         ",44.104258299999998,61.215154699999999,1.5700000000000003]
["HD 18038","","*iC",null,"",44.123678580000004,"2 56 29.6",59.150627370000002,"+59 9 2.25",8.49,8.2100000000000009,"B6V            ","B6","V         ",44.123678580000004,59.150627370000002,2.7899999999999991]
["BD+01 514","","*  ",null,"",44.156854000000003,"2 56 37.6",1.752867,"+1 45 10.32",9.9,9.69,"B7V            ","B7","V         ",44.156854000000003,1.752867,1.3100000000000005]
["HD 18076","","*iC","","",44.218118879999999,"2 56 52.3",59.088932630000002,"+59 5 20.15",9.48,9.0399999999999991,"B0II-III       ","B0","II-III    ",44.218118879999999,59.088932630000002,1.9600000000000009]
["BD+60 596                ",{"$f":"IF(LEFT(A494,2)=\"V*\",\"var\",\"\")","v":""},"*iC","","",44.2834304,"2 57 8",60.662261700000002," 60 39 44.14",10.01,9.7200000000000006,"B1V:n          ","B1","V:n       ",44.2834304,60.662261700000002,1.2799999999999994]
["LT Per","Var","a2*","","",44.32200915,"2 57 17.2",31.934218649999998,"+31 56 3.18",5.085,5.0960000000000001,"B9p...         ","B9","p...      ",44.32200915,31.934218649999998,5.9039999999999999]
["V797 Cas","Var","LP*",null,"",44.407668129999998,"2 57 37.8",61.128735380000002,"+61 7 43.44",7.81,7.67,"B9III          ","B9","III       ",44.407668129999998,61.128735380000002,3.33]
["HD 237039","","*iC","","",44.546008299999997,"2 58 11",59.983371400000003,"+59 59 0.13",9.73,9.5399999999999991,"B9V            ","B9","V         ",44.546008299999997,59.983371400000003,1.4600000000000009]
["HD 237040","","*iC",null,"",44.597305400000003,"2 58 23.3",59.211684699999999,"+59 12 42.06",9.58,9.3699999999999992,"B9p            ","B9","p         ",44.597305400000003,59.211684699999999,1.6300000000000008]
["BD+51 659","","*  ","","",44.696472710000002,"2 58 47.1",52.111511870000001,"+52 6 41.44",9.7100000000000009,9.3699999999999992,"B0IIInn        ","B0","IIInn     ",44.696472710000002,52.111511870000001,1.6300000000000008]
["HD 18294","","*iC",null,"",44.762484200000003,"2 59 2.9",59.8473586,"+59 50 50.49",8.92,8.66,"B8III          ","B8","III       ",44.762484200000003,59.8473586,2.34]
["lam Cet","","*  ",null,"",44.92874947,"2 59 42.8",8.9073583000000003,"+8 54 26.48",4.5979999999999999,4.7009999999999996,"B6III          ","B6","III       ",44.92874947,8.9073583000000003,6.2990000000000004]
["HD 18352                 ",{"$f":"IF(LEFT(A502,2)=\"V*\",\"var\",\"\")","v":""},"*iC","","",44.947367079999999,"2 59 47.3",61.289942420000003," 61 17 23.79",6.9909999999999997,6.8449999999999998,"B1V            ","B1","V         ",44.947367079999999,61.289942420000003,4.1550000000000002]
["HR 894","","Be*",null,"Be",45.04956043,"3 0 11.8",38.131740710000003,"+38 7 54.26",6.0609999999999999,6.1189999999999998,"B8Vne          ","B8","Vne       ",45.04956043,38.131740710000003,4.8810000000000002]
["HD 18458","","*i*",null,"",45.192920999999998,"3 0 46.3",59.652886000000002,"+59 39 10.38",8.09,8.06,"B8II-III       ","B8","II-III    ",45.192920999999998,59.652886000000002,2.9399999999999995]
["HR 890","","*i*",null,"",45.217554020000001,"3 0 52.2",52.351728399999999,"+52 21 6.22",5.1959999999999997,5.2530000000000001,"B7V            ","B7","V         ",45.217554020000001,52.351728399999999,5.7469999999999999]
["HR 891","","*i*",null,"",45.222997769999999,"3 0 53.5",52.352023209999999,"+52 21 7.28",6.74,6.74,"B9V            ","B9","V         ",45.222997769999999,52.352023209999999,4.26]
["V798 Cas","Var","a2*",null,"",45.224101060000002,"3 0 53.7",59.66595392,"+59 39 57.43",7.32,7.34,"B9p...         ","B9","p...      ",45.224101060000002,59.66595392,3.66]
["BD+58 547","","V* ","","",45.392899999999997,"3 1 34.2",59.341700000000003,"+59 20 30.12",10.050000000000001,9.61,"B3II-III       ","B3","II-III    ",45.392899999999997,59.341700000000003,1.3900000000000006]
["HD 237054","","*iC",null,"",45.566248020000003,"3 2 15.8",59.626989289999997,"+59 37 37.16",9.17,9.0399999999999991,"B8V            ","B8","V         ",45.566248020000003,59.626989289999997,1.9600000000000009]
["93 Cet","","*  ",null,"",45.593825420000002,"3 2 22.5",4.3528872099999996,"+4 21 10.39",5.51,5.6070000000000002,"B7V            ","B7","V         ",45.593825420000002,4.3528872099999996,5.3929999999999998]
["HD 237060","","Be*",null,"Be",46.127246,"3 4 30.5",59.446297000000001,"+59 26 46.66",9.4700000000000006,9.1999999999999993,"B9V            ","B9","V         ",46.127246,59.446297000000001,1.8000000000000007]
["HD 18877","","Be*",null,"Be",46.226090800000001,"3 4 54.2",60.025721900000001,"+60 1 32.59",8.52,8.4,"B7II-III       ","B7","II-III    ",46.226090800000001,60.025721900000001,2.5999999999999996]
["HR 928","","*i*",null,"",46.360399999999998,"3 5 26.4",25.255299999999998,"+25 15 19.07",7,7,"B7V            ","B7","V         ",46.360399999999998,25.255299999999998,4]
["52 Ari","","*  ",null,"",46.361200799999999,"3 5 26.6",25.255173790000001,"+25 15 18.62",5.43,5.46,"B7Vn           ",{"$f":"+LEFT(L514,2)","v":"B7"},{"$f":"+IF(MID(L514,3,1)=\".\",MID(L514,5,10),MID(L514,3,10))","v":"Vn        "},46.361200799999999,25.255173790000001,{"$f":"11-K514","v":5.54}]
["HR 927","","*i*",null,"",46.361669999999997,"3 5 26.8",25.25517,"+25 15 18.61",6.78,6.8,"B7V            ","B7","V         ",{"$f":"+F515","v":46.361669999999997},{"$f":"+H515","v":25.25517},4.2]
["BD+61 518","","*  ",null,"",46.5012525,"3 6 0.3",61.580517499999999,"+61 34 49.86",9.81,9.6,"B8V            ","B8","V         ",46.5012525,61.580517499999999,1.4000000000000004]
["HR 922","","*  ",null,"",46.82915758,"3 7 18.9",64.057593859999997,"+64 3 27.33",5.8650000000000002,5.8849999999999998,"B9V            ","B9","V         ",46.82915758,64.057593859999997,5.1150000000000002]
["UW Ari","Var","bC*","","",46.856967130000001,"3 7 25.6",17.879990790000001,"+17 52 47.96",6.0019999999999998,6.1239999999999997,"B1.5V          ","B1","V         ",46.856967130000001,17.879990790000001,4.8760000000000003]
["HR 930","","*  ",null,"",47.01604991,"3 8 3.8",52.213510479999997,"+52 12 48.63",6.3,6.3,"B5V             ","B5","V         ",47.01604991,52.213510479999997,4.7]
["HR 930","","*  ",null,"",47.01604991,"3 8 3.8",52.213510479999997,"+52 12 48.63",6.3,6.3,"B5V             ","B5","V         ",47.01604991,52.213510479999997,4.7]
["bet Per","Var","Al*",null,"",47.042218550000001,"3 8 10.1",40.955646680000001,"+40 57 20.32",2.0699999999999998,2.12,"B8V            ","B8","V         ",47.042218550000001,40.955646680000001,8.879999999999999]
["HD 237070","","*  ",null,"",47.105327899999999,"3 8 25.2",59.804915600000001,"+59 48 17.69",10.23,9.9499999999999993,"B7III          ","B7","III       ",47.105327899999999,59.804915600000001,1.0500000000000007]
["HD 19243                 ",{"$f":"IF(LEFT(A523,2)=\"V*\",\"var\",\"\")","v":""},"Be*","","Be",47.22574418,"3 8 54.1",62.384597120000002," 62 23 4.54",6.7130000000000001,6.5030000000000001,"B1V:e          ","B1","V:e       ",47.22574418,62.384597120000002,4.4969999999999999]
["HD 19341","","*  ",null,"",47.344340019999997,"3 9 22.6",59.357497690000002,"+59 21 26.99",8.2200000000000006,8.1300000000000008,"B8III          ","B8","III       ",47.344340019999997,59.357497690000002,2.8699999999999992]
["BD+59 597","","*  ",null,"",47.350971000000001,"3 9 24.2",60.439619,"+60 26 22.62",9.5500000000000007,9.39,"B9p            ","B9","p         ",47.350971000000001,60.439619,1.6099999999999994]
["HD 237074","","*  ",null,"",47.367686999999997,"3 9 28.2",60.241461000000001,"+60 14 29.25",9.58,9.24,"B8V            ","B8","V         ",47.367686999999997,60.241461000000001,1.7599999999999998]
["55 Ari","","*  ",null,"",47.403094869999997,"3 9 36.7",29.077082099999998,"+29 4 37.49",5.85,5.7489999999999997,"B8III          ","B8","III       ",47.403094869999997,29.077082099999998,5.2510000000000003]
["BD+61 529","","*  ","","",47.5536113,"3 10 12.8",61.951373099999998,"+61 57 4.94",9.7799999999999994,9.5500000000000007,"B3V            ","B3","V         ",47.5536113,61.951373099999998,1.4499999999999993]
["HD 19441","","*  ","","",47.577437539999998,"3 10 18.5",59.524631839999998,"+59 31 28.67",8.1999999999999993,7.95,"B3III          ","B3","III       ",47.577437539999998,59.524631839999998,3.05]
["HR 948","","*  ",null,"",47.661636700000003,"3 10 38.7",11.872623819999999,"+11 52 21.44",5.907,5.9649999999999999,"B8V            ","B8","V         ",47.661636700000003,11.872623819999999,5.0350000000000001]
["BD+61 532","","*  ","","",47.711011999999997,"3 10 50.6",61.603622000000001,"+61 36 13.03",9.4700000000000006,9.36,"B9V            ","B9","V         ",47.711011999999997,61.603622000000001,1.6400000000000006]
["HD 237080","","*  ",null,"",47.755423299999997,"3 11 1.3",59.562071099999997,"+59 33 43.45",9.32,9,"B9III          ","B9","III       ",47.755423299999997,59.562071099999997,2]
["BD+60 635","","*  ",null,"",47.916255,"3 11 39.9",61.405112500000001,"+61 24 18.4",9.68,9.4700000000000006,"B7III          ","B7","III       ",47.916255,61.405112500000001,1.5299999999999994]
["HR 950","","*  ",null,"",48.039819100000003,"3 12 9.5",42.375900600000001,"+42 22 33.24",6.0469999999999997,6.1440000000000001,"B4V            ","B4","V         ",48.039819100000003,42.375900600000001,4.8559999999999999]
["BD+61 534","","*  ",null,"",48.043393700000003,"3 12 10.4",61.584954400000001,"+61 35 5.83",9.57,9.48,"B8V            ","B8","V         ",48.043393700000003,61.584954400000001,1.5199999999999996]
["BD+59 604","","*  ",null,"",48.051924999999997,"3 12 12.4",60.554464000000003,"+60 33 16.07",10.199999999999999,9.93,"B9III          ","B9","III       ",48.051924999999997,60.554464000000003,1.0700000000000003]
["SX Ari","Var","a2*",null,"",48.059361240000001,"3 12 14.2",27.256967960000001,"+27 15 25.08",5.6790000000000003,5.7720000000000002,"B6IV-V         ","B6","IV-V      ",48.059361240000001,27.256967960000001,5.2279999999999998]
["V368 Cas","Var","Al*",null,"",48.148094450000002,"3 12 35.5",59.919696340000002,"+59 55 10.9",8.5,8.32,"B8II-III       ","B8","II-III    ",48.148094450000002,59.919696340000002,2.6799999999999997]
["HD 19653","","*  ",null,"",48.19297443,"3 12 46.3",60.801004140000003,"+60 48 3.61",9.08,8.8699999999999992,"B9p            ","B9","p         ",48.19297443,60.801004140000003,2.1300000000000008]
["HD 19893","","*iC",null,"",48.45972347,"3 13 50.3",49.568877360000002,"+49 34 7.95",7.19,7.16,"B9V            ","B9","V         ",48.45972347,49.568877360000002,3.84]
["BD+59 608","","*  ","","",48.490547100000001,"3 13 57.7",59.841161100000001,"+59 50 28.17",10.25,9.99,"B2III          ","B2","III       ",48.490547100000001,59.841161100000001,1.0099999999999998]
["BD+60 645","","*  ",null,"",48.613297899999999,"3 14 27.1",61.516651400000001,"+61 30 59.94",9.81,9.61,"B8III          ","B8","III       ",48.613297899999999,61.516651400000001,1.3900000000000006]
["BD+60 646","","*  ",null,"",48.663491700000002,"3 14 39.2",61.4578092,"+61 27 28.11",9.98,9.82,"B6III          ","B6","III       ",48.663491700000002,61.4578092,1.1799999999999997]
["HD 20023","","*iC",null,"",48.71099555,"3 14 50.6",47.155039870000003,"+47 9 18.14",7.97,7.95,"B9III:         ","B9","III:      ",48.71099555,47.155039870000003,3.05]
["BD+58 578","","*  ","","",48.725000000000001,"3 14 54",59.1036,"+59 6 12.96",10.18,9.75,"B3III          ","B3","III       ",48.725000000000001,59.1036,1.25]
["HD 20017","","Be*",null,"Be",48.730462500000002,"3 14 55.3",48.695796799999997,"+48 41 44.86",8.1300000000000008,7.91,"B5Ve            ","B5","Ve        ",48.730462500000002,48.695796799999997,3.09]
["HD 20017","","Be*",null,"Be",48.730462500000002,"3 14 55.3",48.695796799999997,"+48 41 44.86",8.1300000000000008,7.91,"B5Ve            ","B5","Ve        ",48.730462500000002,48.695796799999997,3.09]
["HD 237090","","Be*","","Be",48.79553619,"3 15 10.9",59.911896259999999,"+59 54 42.82",9.48,9.0299999999999994,"B0.5IV:nn      ","B0","IV:nn     ",48.79553619,59.911896259999999,1.9700000000000006]
["HD 19968","","*  ",null,"",48.910335529999998,"3 15 38.4",61.127944739999997,"+61 7 40.6",7.62,7.6,"B5III           ","B5","III       ",48.910335529999998,61.127944739999997,3.4000000000000004]
["HD 19968","","*  ",null,"",48.910335529999998,"3 15 38.4",61.127944739999997,"+61 7 40.6",7.62,7.6,"B5III           ","B5","III       ",48.910335529999998,61.127944739999997,3.4000000000000004]
["HD 237096","","*  ","","",48.980919200000002,"3 15 55.4",60.026025599999997,"+60 1 33.69",10,9.69,"B9V            ","B9","V         ",48.980919200000002,60.026025599999997,1.3100000000000005]
["BD+60 655","","*  ",null,"",49.240682999999997,"3 16 57.7",61.294806000000001,"+61 17 41.3",10.17,9.93,"B8IV           ","B8","IV        ",49.240682999999997,61.294806000000001,1.0700000000000003]
["HD 20134","","Be*","","Be",49.248968640000001,"3 16 59.7",60.067490720000002,"+60 4 2.96",7.54,7.47,"B2.5IV-V       ","B2","IV-V      ",49.248968640000001,60.067490720000002,3.5300000000000002]
["BD+60 657","","*  ",null,"",49.265708699999998,"3 17 3.7",60.951608100000001,"+60 57 5.78",9.5299999999999994,9.42,"B5V             ","B5","V         ",49.265708699999998,60.951608100000001,1.58]
["BD+60 657","","*  ",null,"",49.265708699999998,"3 17 3.7",60.951608100000001,"+60 57 5.78",9.5299999999999994,9.42,"B5V             ","B5","V         ",49.265708699999998,60.951608100000001,1.58]
["BD+39 743A","","*i*",null,"",49.297710000000002,"3 17 11.4",40.482939999999999,"+40 28 58.58",6.7,6.8,"B9p...         ","B9","p...      ",49.297710000000002,40.482939999999999,4.2]
["CCDM J03172+4029AB","","** ",null,"",49.297747749999999,"3 17 11.4",40.482970340000001,"+40 28 58.69",6.43,6.46,"B9Vsp...       ","B9","Vsp...    ",49.297747749999999,40.482970340000001,4.54]
["LTT 16013","","PM*",null,"",49.436063699999998,"3 17 44.6",61.113854400000001,"+61 6 49.87",9.7799999999999994,9.57,"B8V            ","B8","V         ",49.436063699999998,61.113854400000001,1.4299999999999997]
["30 Per","","*  ",null,"",49.447303609999999,"3 17 47.3",44.025022210000003,"+44 1 30.07",5.4189999999999996,5.4779999999999998,"B8V            ","B8","V         ",49.447303609999999,44.025022210000003,5.5220000000000002]
["29 Per","","*iC","","",49.657255280000001,"3 18 37.7",50.222175710000002,"+50 13 19.83",5.085,5.1580000000000004,"B3V            ","B3","V         ",49.657255280000001,50.222175710000002,5.8419999999999996]
["HD 20295","","*  ",null,"",49.693879430000003,"3 18 46.5",59.634485300000001,"+59 38 4.14",8.58,8.4,"B5III           ","B5","III       ",49.693879430000003,59.634485300000001,2.5999999999999996]
["HD 20295","","*  ",null,"",49.693879430000003,"3 18 46.5",59.634485300000001,"+59 38 4.14",8.58,8.4,"B5III           ","B5","III       ",49.693879430000003,59.634485300000001,2.5999999999999996]
["31 Per","","*iC",null,"",49.781828849999997,"3 19 7.6",50.094967400000002,"+50 5 41.88",4.9690000000000003,5.0359999999999996,"B5V             ","B5","V         ",49.781828849999997,50.094967400000002,5.9640000000000004]
["31 Per","","*iC",null,"",49.781828849999997,"3 19 7.6",50.094967400000002,"+50 5 41.88",4.9690000000000003,5.0359999999999996,"B5V             ","B5","V         ",49.781828849999997,50.094967400000002,5.9640000000000004]
["BD+60 665","","*  ",null,"",49.786141999999998,"3 19 8.6",60.791938999999999,"+60 47 30.98",9.89,9.66,"B9V            ","B9","V         ",49.786141999999998,60.791938999999999,1.3399999999999999]
["HR 985","","Be*","","Be",49.996969460000003,"3 19 59.2",65.652291719999994,"+65 39 8.25",4.6210000000000004,4.7279999999999998,"B2.5Vne        ","B2","Vne       ",49.996969460000003,65.652291719999994,6.2720000000000002]
["HD 237118","","Be*",null,"Be",50.00497172,"3 20 1.1",59.864095399999997,"+59 51 50.74",9.5500000000000007,9.42,"B6V            ","B6","V         ",50.00497172,59.864095399999997,1.58]
["HD 20510","","*iC",null,"",50.026099139999999,"3 20 6.2",50.96876133,"+50 58 7.54",7.11,7.06,"B9V            ","B9","V         ",50.026099139999999,50.96876133,3.9400000000000004]
["HD 237121","","*  ","","",50.186711240000001,"3 20 44.8",58.85555789,"+58 51 20",9.33,8.99,"B0.5V          ","B0","V         ",50.186711240000001,58.85555789,2.0099999999999998]
["HD 20508","","V* ","","",50.223209609999998,"3 20 53.5",60.030351809999999,"+60 1 49.26",8.75,8.41,"B1.5IV         ","B1","IV        ",50.223209609999998,60.030351809999999,2.59]
["HD 20547","","*i*","","",50.297964839999999,"3 21 11.5",59.167659810000004,"+59 10 3.57",8.6199999999999992,8.34,"B3III          ","B3","III       ",50.297964839999999,59.167659810000004,2.66]
["tau01 Ari","Var","bL*",null,"",50.306767139999998,"3 21 13.6",21.147087500000001,"+21 8 49.51",5.2270000000000003,5.3010000000000002,"B5IV            ","B5","IV        ",50.306767139999998,21.147087500000001,5.6989999999999998]
["tau01 Ari","Var","bL*",null,"",50.306767139999998,"3 21 13.6",21.147087500000001,"+21 8 49.51",5.2270000000000003,5.3010000000000002,"B5IV            ","B5","IV        ",50.306767139999998,21.147087500000001,5.6989999999999998]
["TYC 4049-1165-1","","*  ",null,"",50.351658,"3 21 24.3",61.281936000000002,"+61 16 54.96",10.119999999999999,9.98,"B9V            ","B9","V         ",50.351658,61.281936000000002,1.0199999999999996]
["HD 237126","","*  ",null,"",50.580071699999998,"3 22 19.2",59.819716399999997,"+59 49 10.97",9.8000000000000007,9.48,"B7III          ","B7","III       ",50.580071699999998,59.819716399999997,1.5199999999999996]
["HD 237128","","*  ",null,"",50.752817,"3 23 0.6",59.077111000000002,"+59 4 37.59",10.039999999999999,9.7899999999999991,"B7III          ","B7","III       ",50.752817,59.077111000000002,1.2100000000000009]
["V575 Per","Var","LP*",null,"",50.804981699999999,"3 23 13.1",49.213267360000003,"+49 12 47.76",5.23,5.3,"B5V             ","B5","V         ",50.804981699999999,49.213267360000003,5.7]
["V575 Per","Var","LP*",null,"",50.804981699999999,"3 23 13.1",49.213267360000003,"+49 12 47.76",5.23,5.3,"B5V             ",{"$f":"+LEFT(L578,2)","v":"B5"},{"$f":"+IF(MID(L578,3,1)=\".\",MID(L578,5,10),MID(L578,3,10))","v":"V         "},50.804981699999999,49.213267360000003,{"$f":"11-K578","v":5.7}]
["HD 20761","","*  ",null,"",50.927737,"3 23 42.6",61.441527999999998,"+61 26 29.5",9.8699999999999992,9.69,"B9V            ","B9","V         ",{"$f":"+F579","v":50.927737},{"$f":"+H579","v":61.441527999999998},1.3100000000000005]
["HD 20863","","*iC",null,"",50.94720495,"3 23 47.3",48.604416059999998,"+48 36 15.89",7,6.99,"B9V            ","B9","V         ",50.94720495,48.604416059999998,4.01]
["HD 20798","","*iN","","",51.05910729,"3 24 14.1",61.538572770000002,"+61 32 18.86",8.58,8.39,"B2III-IV       ","B2","III-IV    ",51.05910729,61.538572770000002,2.6099999999999994]
["BD+49 916","","*iC","","",51.072099600000001,"3 24 17.3",49.666642500000002,"+49 39 59.91",9.7100000000000009,9.68,"B2psh...       ","B2","psh...    ",51.072099600000001,49.666642500000002,1.3200000000000003]
["HD 237134","","Be*",null,"Be",51.263754200000001,"3 25 3.3",60.252937199999998,"+60 15 10.57",9.83,9.49,"B5V             ","B5","V         ",51.263754200000001,60.252937199999998,1.5099999999999998]
["HD 237134","","Be*",null,"Be",51.263754200000001,"3 25 3.3",60.252937199999998,"+60 15 10.57",9.83,9.49,"B5V             ","B5","V         ",51.263754200000001,60.252937199999998,1.5099999999999998]
["HD 20898","","V* ","","",51.31776533,"3 25 16.2",60.483712279999999,"+60 29 1.36",8.36,8,"B2III          ","B2","III       ",51.31776533,60.483712279999999,3]
["HD 20959","","*  ","","",51.449876969999998,"3 25 47.9",59.432464349999997,"+59 25 56.87",8.26,8.0500000000000007,"B3III          ","B3","III       ",51.449876969999998,59.432464349999997,2.9499999999999993]
["BD+30 540","","*iN",null,"",51.458752740000001,"3 25 50.1",30.931706989999999,"+30 55 54.14",9.49,9.2200000000000006,"B8V            ","B8","V         ",51.458752740000001,30.931706989999999,1.7799999999999994]
["V576 Per","Var","LP*",null,"",51.489088289999998,"3 25 57.3",49.120754779999999,"+49 7 14.71",5.9939999999999998,6.0709999999999997,"B7V            ","B7","V         ",51.489088289999998,49.120754779999999,4.9290000000000003]
["BD+60 682","","*  ","","",51.698511199999999,"3 26 47.6",60.852993300000001,"+60 51 10.77",10.16,9.7100000000000009,"B3III          ","B3","III       ",51.698511199999999,60.852993300000001,1.2899999999999991]
["HD 21152","","*iC",null,"",51.709384200000002,"3 26 50.2",47.916108600000001,"+47 54 57.99",7.82,7.73,"B9V            ","B9","V         ",51.709384200000002,47.916108600000001,3.2699999999999996]
["ksi Tau","","*  ",null,"",51.792294640000001,"3 27 10.1",9.7326762099999993,"+9 43 57.63",3.6629999999999998,3.7269999999999999,"B9Vn           ","B9","Vn        ",51.792294640000001,9.7326762099999993,7.2729999999999997]
["HD 21238","","*iC",null,"",51.912372159999997,"3 27 38.9",49.59991488,"+49 35 59.69",6.9,6.93,"B9V            ","B9","V         ",51.912372159999997,49.59991488,4.07]
["BD+58 603","","*  ",null,"",51.934647900000002,"3 27 44.3",59.0069631,"+59 0 25.06",10.06,9.85,"B5IV            ","B5","IV        ",51.934647900000002,59.0069631,1.1500000000000004]
["BD+58 603","","*  ",null,"",51.934647900000002,"3 27 44.3",59.0069631,"+59 0 25.06",10.06,9.85,"B5IV            ","B5","IV        ",51.934647900000002,59.0069631,1.1500000000000004]
["HR 1034","","*  ",null,"",52.0127928,"3 28 3",49.062866280000001,"+49 3 46.31",4.8899999999999997,4.97,"B5V             ","B5","V         ",52.0127928,49.062866280000001,6.03]
["HR 1034","","*  ",null,"",52.0127928,"3 28 3",49.062866280000001,"+49 3 46.31",4.8899999999999997,4.97,"B5V             ","B5","V         ",52.0127928,49.062866280000001,6.03]
["HR 1033","","*i*",null,"",52.098294770000003,"3 28 23.5",60.255675259999997,"+60 15 20.43",6.5039999999999996,6.492,"B9V+...        ","B9","V+...     ",52.098294770000003,60.255675259999997,4.508]
["HD 21212","","Be*","","Be",52.163304330000003,"3 28 39.1",62.49300075,"+62 29 34.8",8.76,8.31,"B2V:e          ","B2","V:e       ",52.163304330000003,62.49300075,2.6899999999999995]
["HD 21483","","*  ",null,"",52.194381749999998,"3 28 46.6",30.375340250000001,"+30 22 31.22",7.39,7.07,"B3III          ","B3","III       ",52.194381749999998,30.375340250000001,3.9299999999999997]
["HR 1037","","*iC",null,"",52.218028850000003,"3 28 52.3",49.848381619999998,"+49 50 54.17",5.5229999999999997,5.5780000000000003,"B6Vn           ","B6","Vn        ",52.218028850000003,49.848381619999998,5.4219999999999997]
["HD 21398","","*iC",null,"",52.2818592,"3 29 7.6",48.302896699999998,"+48 18 10.42",7.38,7.37,"B9V            ","B9","V         ",52.2818592,48.302896699999998,3.63]
["34 Per","","*  ",null,"",52.341875799999997,"3 29 22",49.508947620000001,"+49 30 32.21",4.5780000000000003,4.6779999999999999,"B3V            ","B3","V         ",52.341875799999997,49.508947620000001,6.3220000000000001]
["HR 1047","","Be*",null,"Be",52.359515500000001,"3 29 26.2",46.937867109999999,"+46 56 16.32",6.319,6.2270000000000003,"B7V            ","B7","V         ",52.359515500000001,46.937867109999999,4.7729999999999997]
["HR 1051","","*iC",null,"",52.653967180000002,"3 30 36.9",48.10359708,"+48 6 12.94",5.7770000000000001,5.8170000000000002,"B8V            ","B8","V         ",52.653967180000002,48.10359708,5.1829999999999998]
["HR 1059","","*iC",null,"",52.954323960000004,"3 31 49",49.401092669999997,"+49 24 3.93",6.4790000000000001,6.4139999999999997,"B9III          ","B9","III       ",52.954323960000004,49.401092669999997,4.5860000000000003]
["HD 21672","","*iC",null,"",52.974781880000002,"3 31 53.9",48.735145639999999,"+48 44 6.52",6.61,6.63,"B8V            ","B8","V         ",52.974781880000002,48.735145639999999,4.37]
["V396 Per","Var","Ro*",null,"",53.035843200000002,"3 32 8.6",48.023475429999998,"+48 1 24.51",5.3650000000000002,5.4630000000000001,"B8IIImnp       ","B8","IIImnp    ",53.035843200000002,48.023475429999998,5.5369999999999999]
["t Tau","","*  ",null,"",53.149784400000001,"3 32 35.9",9.3734395900000003,"+9 22 24.38",5.6879999999999997,5.75,"B9IV           ","B9","IV        ",53.149784400000001,9.3734395900000003,5.25]
["KP Per","Var","bC*","","",53.162405569999997,"3 32 38.9",44.855760330000003,"+44 51 20.73",6.44,6.41,"B2IV           ","B2","IV        ",53.162405569999997,44.855760330000003,4.59]
["HR 1074                  ",{"$f":"IF(LEFT(A610,2)=\"V*\",\"var\",\"\")","v":""},"V* ","","",53.16673256,"3 32 40",35.461728819999998," 35 27 42.22",5.8159999999999998,5.899,"B1V            ","B1","V         ",53.16673256,35.461728819999998,5.101]
["HD 21931","","*  ",null,"",53.554007319999997,"3 34 12.9",48.617461200000001,"+48 37 2.86",7.39,7.37,"B9V            ","B9","V         ",53.554007319999997,48.617461200000001,3.63]
["HD 21843","","*  ","","",53.579766810000002,"3 34 19.1",59.73493268,"+59 44 5.75",8.44,7.78,"B3III          ","B3","III       ",53.579766810000002,59.73493268,3.2199999999999998]
["HD 21806                 ",{"$f":"IF(LEFT(A613,2)=\"V*\",\"var\",\"\")","v":""},"*  ","","",53.660593759999998,"3 34 38.5",63.888925520000001," 63 53 20.13",8,7.78,"B1Vn...        ","B1","Vn...     ",53.660593759999998,63.888925520000001,3.2199999999999998]
["HD 232809","","*  ","","",53.725004200000001,"3 34 54",53.937621399999998,"+53 56 15.43",9.7100000000000009,9.23,"B2V            ","B2","V         ",53.725004200000001,53.937621399999998,1.7699999999999996]
["V496 Per","Var","a2*",null,"",53.799473579999997,"3 35 11.8",38.01517029,"+38 0 54.61",7.65,7.58,"B8Vp           ","B8","Vp        ",53.799473579999997,38.01517029,3.42]
["HD 22136","","V* ",null,"",53.993708290000001,"3 35 58.4",47.091026659999997,"+47 5 27.69",6.8550000000000004,6.8780000000000001,"B8V            ","B8","V         ",53.993708290000001,47.091026659999997,4.1219999999999999]
["psi Per","","Be*",null,"Be",54.122415930000003,"3 36 29.3",48.192633039999997,"+48 11 33.47",4.2549999999999999,4.3099999999999996,"B5Ve            ","B5","Ve        ",54.122415930000003,48.192633039999997,6.69]
["psi Per","","Be*",null,"Be",54.122415930000003,"3 36 29.3",48.192633039999997,"+48 11 33.47",4.2549999999999999,4.3099999999999996,"B5Ve            ","B5","Ve        ",54.122415930000003,48.192633039999997,6.69]
["HD 22253","","*  ","","",54.433952660000003,"3 37 44.1",56.739387839999999,"+56 44 21.79",6.7629999999999999,6.5449999999999999,"B0.5III        ","B0","III       ",54.433952660000003,56.739387839999999,4.4550000000000001]
["HR 1097","","*  ",null,"",54.50075691,"3 38 0.1",42.582846539999998,"+42 34 58.24",6.3410000000000002,6.4050000000000002,"B8Vn           ","B8","Vn        ",54.50075691,42.582846539999998,4.5949999999999998]
["HD 22298","","Be*","","Be",54.50431811,"3 38 1",55.170856749999999,"+55 10 15.08",8.09,7.69,"B2Vne          ","B2","Vne       ",54.50431811,55.170856749999999,3.3099999999999996]
["KZ Cam","Var","a2*",null,"",54.582231759999999,"3 38 19.7",56.932715039999998,"+56 55 57.77",6.1840000000000002,6.2809999999999997,"B9p            ","B9","p         ",54.582231759999999,56.932715039999998,4.7190000000000003]
["BD+49 991","","*iC",null,"",55.235326239999999,"3 40 56.4",49.506162760000002,"+49 30 22.18",10.01,9.9600000000000009,"B8V            ","B8","V         ",55.235326239999999,49.506162760000002,1.0399999999999991]
["HR 1113","","Be*",null,"Be",55.282739450000001,"3 41 7.8",37.580197409999997,"+37 34 48.71",5.4790000000000001,5.5410000000000004,"B7Vne          ","B7","Vne       ",55.282739450000001,37.580197409999997,5.4589999999999996]
["13 Tau","","Be*",null,"Be",55.57894623,"3 42 18.9",19.700255729999999,"+19 42 0.92",5.6639999999999997,5.681,"B9Vne          ","B9","Vne       ",55.57894623,19.700255729999999,5.319]
["o Per","","*i*","","",55.594356470000001,"3 42 22.6",33.965024819999996,"+33 57 54.08",4.9269999999999996,4.9749999999999996,"B0.5V          ","B0","V         ",55.594356470000001,33.965024819999996,6.0250000000000004]
["del Per","","Be*",null,"Be",55.73126774,"3 42 55.5",47.787548510000001,"+47 47 15.17",2.88,2.99,"B5III           ","B5","III       ",55.73126774,47.787548510000001,8.01]
["del Per","","Be*",null,"Be",55.73126774,"3 42 55.5",47.787548510000001,"+47 47 15.17",2.88,2.99,"B5III           ","B5","III       ",55.73126774,47.787548510000001,8.01]
["HD 23060","","*  ","","",55.850043749999998,"3 43 24",34.11625428,"+34 6 58.51",7.61,7.5,"B2Vp           ","B2","Vp        ",55.850043749999998,34.11625428,3.5]
["V* omi Per               ",{"$f":"IF(LEFT(A630,2)=\"V*\",\"var\",\"\")","v":"var"},"El*","","",56.079716849999997,"3 44 19.1",32.288248019999997," 32 17 17.69",3.871,3.855,"B1III          ","B1","III       ",56.079716849999997,32.288248019999997,7.1449999999999996]
["CELENO","","V* ",null,"",56.2008966,"3 44 48.2",24.289468100000001,"+24 17 22.08",5.4059999999999997,5.4480000000000004,"B7IV           ","B7","IV        ",56.2008966,24.289468100000001,5.5519999999999996]
["ELECTRA","","Be*",null,"Be",56.218903679999997,"3 44 52.5",24.113336449999998,"+24 6 48.01",3.6120000000000001,3.7050000000000001,"B6IIIe         ","B6","IIIe      ",56.218903679999997,24.113336449999998,7.2949999999999999]
["18 Tau","","*iC",null,"",56.290583009999999,"3 45 9.7",24.839260209999999,"+24 50 21.33",5.585,5.6509999999999998,"B8V            ","B8","V         ",56.290583009999999,24.839260209999999,5.3490000000000002]
["TAYGETA","","*i*",null,"",56.302065749999997,"3 45 12.4",24.467280479999999,"+24 28 2.2",4.1989999999999998,4.2910000000000004,"B6IV           ","B6","IV        ",56.302065749999997,24.467280479999999,6.7089999999999996]
["HD 23219","","*  ",null,"",56.364824249999998,"3 45 27.5",47.660350379999997,"+47 39 37.26",7.15,7.17,"B9V            ","B9","V         ",56.364824249999998,47.660350379999997,3.83]
["u Tau","","*  ",null,"",56.418514930000001,"3 45 40.4",6.0499930700000002,"+6 2 59.97",5.234,5.3319999999999999,"B3V            ","B3","V         ",56.418514930000001,6.0499930700000002,5.6680000000000001]
["MAIA","","*i*",null,"",56.45669401,"3 45 49.6",24.36774621,"+24 22 3.88",3.8119999999999998,3.871,"B8III          ","B8","III       ",56.45669401,24.36774621,7.1289999999999996]
["ASTEROPE","","V* ",null,"",56.476987029999997,"3 45 54.4",24.55451227,"+24 33 16.24",5.7270000000000003,5.7610000000000001,"B8V            ","B8","V         ",56.476987029999997,24.55451227,5.2389999999999999]
["HD 23243","","*  ",null,"",56.493359599999998,"3 45 58.4",52.916813099999999,"+52 55 0.52",9.58,9.14,"B9III          ","B9","III       ",56.493359599999998,52.916813099999999,1.8599999999999994]
["HR 1141","","*i*",null,"",56.496916659999997,"3 45 59.2",45.68189658,"+45 40 54.82",5.5739999999999998,5.6529999999999996,"B6V            ","B6","V         ",56.496916659999997,45.68189658,5.3470000000000004]
["V971 Tau","Var","bC*",null,"",56.581557680000003,"3 46 19.5",23.948355899999999,"+23 56 54.08",4.1130000000000004,4.1639999999999997,"B6IVe          ","B6","IVe       ",56.581557680000003,23.948355899999999,6.8360000000000003]
["HD 23478","","Pu*","","",56.670297679999997,"3 46 40.8",32.290187719999999,"+32 17 24.67",6.7169999999999996,6.6879999999999997,"B3IV...        ",{"$f":"+LEFT(L642,2)","v":"B3"},{"$f":"+IF(MID(L642,3,1)=\".\",MID(L642,5,10),MID(L642,3,10))","v":"IV...     "},56.670297679999997,32.290187719999999,{"$f":"11-K642","v":4.3120000000000003}]
["ALCYONE","","Be*",null,"Be",56.871152309999999,"3 47 29",24.105135650000001,"+24 6 18.48",2.806,2.8730000000000002,"B7III          ","B7","III       ",{"$f":"+F643","v":56.871152309999999},{"$f":"+H643","v":24.105135650000001},8.1269999999999989]
["HR 1147","","*  ",null,"",56.883950480000003,"3 47 32.1",55.921960179999999,"+55 55 19.05",6.0739999999999998,6.0940000000000003,"B9Vnn          ","B9","Vnn       ",56.883950480000003,55.921960179999999,4.9059999999999997]
["HR 1163","","*  ","","",56.969440540000001,"3 47 52.6",33.599870230000001,"+33 35 59.53",6.6740000000000004,6.6529999999999996,"B2.5V          ","B2","V         ",56.969440540000001,33.599870230000001,4.3470000000000004]
["e Tau","","V* ","","",57.067781359999998,"3 48 16.2",11.14329657,"+11 8 35.86",4.92,5.0599999999999996,"B3V+...        ","B3","V+...     ",57.067781359999998,11.14329657,5.94]
["HR 1160","","Be*",null,"Be",57.075312519999997,"3 48 18",50.736768240000004,"+50 44 12.36",6.2,6.15,"B8Vne          ","B8","Vne       ",57.075312519999997,50.736768240000004,4.8499999999999996]
["HR 1172","","V* ",null,"",57.086732230000003,"3 48 20.8",23.421250449999999,"+23 25 16.5",5.3780000000000001,5.4409999999999998,"B8V            ","B8","V         ",57.086732230000003,23.421250449999999,5.5590000000000002]
["ATLAS","","*  ",null,"",57.2905941,"3 49 9.7",24.05341675,"+24 3 12.3",3.54,3.62,"B8III          ","B8","III       ",57.2905941,24.05341675,7.38]
["PLEIONE","","Be*",null,"Be",57.296732290000001,"3 49 11.2",24.136710839999999,"+24 8 12.15",4.9669999999999996,5.048,"B8Vne          ","B8","Vne       ",57.296732290000001,24.136710839999999,5.952]
["HD 23675","","*i*","","",57.364877120000003,"3 49 27.5",52.655402070000001,"+52 39 19.44",7.12,6.82,"B0.5III        ","B0","III       ",57.364877120000003,52.655402070000001,4.18]
["HR 1183","","*iC",null,"",57.431377439999999,"3 49 43.5",23.71185427,"+23 42 42.67",6.1239999999999997,6.1719999999999997,"B8V            ","B8","V         ",57.431377439999999,23.71185427,4.8280000000000003]
["HR 1185","","*iC",null,"",57.479472010000002,"3 49 55",22.244154680000001,"+22 14 38.95",6.0570000000000004,6.07,"B8III          ","B8","III       ",57.479472010000002,22.244154680000001,4.93]
["HD 23800                 ",{"$f":"IF(LEFT(A654,2)=\"V*\",\"var\",\"\")","v":""},"Be*","","Be",57.604469020000003,"3 50 25",52.481902920000003," 52 28 54.85",7.2,6.98,"B1IV           ","B1","IV        ",57.604469020000003,52.481902920000003,4.0199999999999996]
["V766 Tau","Var","a2*",null,"",57.81612526,"3 51 15.8",13.04607693,"+13 2 45.87",6.2309999999999999,6.2930000000000001,"B9sp...        ","B9","sp...     ",57.81612526,13.04607693,4.7069999999999999]
["HR 1166","","*  ",null,"",57.924066240000002,"3 51 41.7",68.507485349999996,"+68 30 26.94",6.2450000000000001,6.3029999999999999,"B9IVp          ","B9","IVp       ",57.924066240000002,68.507485349999996,4.6970000000000001]
["HR 1191                  ",{"$f":"IF(LEFT(A657,2)=\"V*\",\"var\",\"\")","v":""},"*i*","","",57.973834580000002,"3 51 53.7",34.359120390000001," 34 21 32.83",5.7469999999999999,5.7839999999999998,"B1V            ","B1","V         ",57.973834580000002,34.359120390000001,5.2160000000000002]
["31 Tau","","*  ",null,"",58.00095752,"3 52 0.2",6.5349051100000004,"+6 32 5.65",5.7210000000000001,5.6909999999999998,"B5V             ","B5","V         ",58.00095752,6.5349051100000004,5.3090000000000002]
["31 Tau","","*  ",null,"",58.00095752,"3 52 0.2",6.5349051100000004,"+6 32 5.65",5.7210000000000001,5.6909999999999998,"B5V             ","B5","V         ",58.00095752,6.5349051100000004,5.3090000000000002]
["HD 24190","","*  ","","",58.079000839999999,"3 52 18.9",34.22211428,"+34 13 19.61",7.46,7.45,"B2V            ","B2","V         ",58.079000839999999,34.22211428,3.55]
["HD 24227","","*  ",null,"",58.425889939999998,"3 53 42.2",50.946102449999998,"+50 56 45.96",8.66,8.56,"B9V            ","B9","V         ",58.425889939999998,50.946102449999998,2.4399999999999995]
["BD+31 666B","","*i*",null,"",58.531080000000003,"3 54 7.4",31.880500000000001,"+31 52 49.8",9.39,9.16,"B8V            ","B8","V         ",58.531080000000003,31.880500000000001,1.8399999999999999]
["HD 24376","","*  ",null,"",58.790567099999997,"3 55 9.7",52.394957499999997,"+52 23 41.84",9.4499999999999993,9.31,"B9V            ","B9","V         ",58.790567099999997,52.394957499999997,1.6899999999999995]
["X Per","Var","HXB","","",58.84615479,"3 55 23",31.045835069999999,"+31 2 45",6.84,6.72,"O9.5IIIe-B0Ve    ","O9","IIIe-B0Ve ",58.84615479,31.045835069999999,4.28]
["HR 1207","","*  ",null,"",58.992393300000003,"3 55 58.1",47.871421779999999,"+47 52 17.11",5.306,5.3789999999999996,"B6V            ","B6","V         ",58.992393300000003,47.871421779999999,5.6210000000000004]
["HD 24560","","Be*","","Be",59.084839359999997,"3 56 20.3",44.937487480000001,"+44 56 14.95",7.99,7.78,"B1.5Vne        ","B1","Vne       ",59.084839359999997,44.937487480000001,3.2199999999999998]
["HR 1215","","Ce*","","",59.11954549,"3 56 28.6",35.080898589999997,"+35 4 51.23",5.431,5.4889999999999999,"B1.5V          ","B1","V         ",59.11954549,35.080898589999997,5.5110000000000001]
["HR 1204","","Be*",null,"Be",59.356015829999997,"3 57 25.4",63.072262270000003,"+63 4 20.14",4.8929999999999998,4.9459999999999997,"B9V            ","B9","V         ",59.356015829999997,63.072262270000003,6.0540000000000003]
["ADS 2888 AB","","** ","","",59.462499999999999,"3 57 50.9",40.011400000000002,"+40 0 41.04",2.7,2.9,"B0.5III        ","B0","III       ",59.462499999999999,40.011400000000002,8.1]
["eps Per","Var","bC*","","",59.463466869999998,"3 57 51.2",40.01021532,"+40 0 36.77",2.7330000000000001,2.9009999999999998,"B0.5V+...      ","B0","V+...     ",59.463466869999998,40.01021532,8.0990000000000002]
["HD 24899","","*iC",null,"",59.587071829999999,"3 58 20.8",24.081125350000001,"+24 4 52.05",7.2279999999999998,7.2110000000000003,"B9V            ","B9","V         ",59.587071829999999,24.081125350000001,3.7889999999999997]
["HD 232864                ",{"$f":"IF(LEFT(A672,2)=\"V*\",\"var\",\"\")","v":""},"*  ","","",59.893495979999997,"3 59 34.4",52.312618319999999," 52 18 45.42",9.6199999999999992,9.48,"B1IV           ","B1","IV        ",59.893495979999997,52.312618319999999,1.5199999999999996]
["HD 237204","","*  ","","",60.097013879999999,"4 0 23.2",56.901596550000001,"+56 54 5.74",9.4,9.18,"B0.5V          ","B0","V         ",60.097013879999999,56.901596550000001,1.8200000000000003]
["lam Tau","Var","Al*","","",60.170065489999999,"4 0 40.8",12.49034054,"+12 29 25.22",3.31,3.4079999999999999,"B3V+...        ","B3","V+...     ",60.170065489999999,12.49034054,7.5920000000000005]
["HD 24979","","*  ",null,"",60.191996199999998,"4 0 46",52.985461100000002,"+52 59 7.65",9.36,9.1300000000000008,"B9V            ","B9","V         ",60.191996199999998,52.985461100000002,1.8699999999999992]
["HD 25201","","*i*",null,"",60.23674398,"4 0 56.8",23.201484130000001,"+23 12 5.34",6.94,6.92,"B9V            ","B9","V         ",60.23674398,23.201484130000001,4.08]
["HR 1243","","*i*",null,"",60.442233989999998,"4 1 46.1",9.9980120299999999,"+9 59 52.84",5.6790000000000003,5.6760000000000002,"B5V             ","B5","V         ",60.442233989999998,9.9980120299999999,5.3239999999999998]
["HR 1243","","*i*",null,"",60.442233989999998,"4 1 46.1",9.9980120299999999,"+9 59 52.84",5.6790000000000003,5.6760000000000002,"B5V             ","B5","V         ",60.442233989999998,9.9980120299999999,5.3239999999999998]
["HD 25141","","*  ",null,"",60.560160000000003,"4 2 14.4",52.877316700000002,"+52 52 38.34",9.02,8.91,"B5V             ","B5","V         ",60.560160000000003,52.877316700000002,2.09]
["HD 25141","","*  ",null,"",60.560160000000003,"4 2 14.4",52.877316700000002,"+52 52 38.34",9.02,8.91,"B5V             ","B5","V         ",60.560160000000003,52.877316700000002,2.09]
["HD 232874","","*  ","","",60.565600250000003,"4 2 15.7",53.753273229999998,"+53 45 11.78",9.26,8.92,"B0.5V          ","B0","V         ",60.565600250000003,53.753273229999998,2.08]
["HD 25413","","*  ",null,"",60.580383699999999,"4 2 19.2",6.7474199999999998E-2,"+0 4 2.9",9.7200000000000006,9.24,"B8V            ","B8","V         ",60.580383699999999,6.7474199999999998E-2,1.7599999999999998]
["HD 25132","","*  ","","",60.682158319999999,"4 2 43.7",58.949304920000003,"+58 56 57.49",7.6,7.55,"B3V            ","B3","V         ",60.682158319999999,58.949304920000003,3.45]
["HD 25090","","*  ","","",60.729783019999999,"4 2 55.1",62.42131217,"+62 25 16.72",7.64,7.34,"B0.5III        ","B0","III       ",60.729783019999999,62.42131217,3.66]
["HD 25235","","*  ",null,"",60.769002559999997,"4 3 4.5",52.629039319999997,"+52 37 44.54",9.01,8.83,"B9V            ","B9","V         ",60.769002559999997,52.629039319999997,2.17]
["V1133 Tau","Var","LP*","","",60.93585479,"4 3 44.6",5.4356240299999996,"+5 26 8.24",5.2290000000000001,5.3079999999999998,"B3V            ","B3","V         ",60.93585479,5.4356240299999996,5.6920000000000002]
["HD 25487","","Be*",null,"Be",60.976319529999998,"4 3 54.3",28.125971870000001,"+28 7 33.49",8.1300000000000008,8.08,"B8Ve+K0IV      ","B8","Ve+K0IV   ",60.976319529999998,28.125971870000001,2.92]
["HD 25348                 ",{"$f":"IF(LEFT(A688,2)=\"V*\",\"var\",\"\")","v":""},"Be*","","Be",61.090164219999998,"4 4 21.6",53.329047719999998," 53 19 44.57",8.39,8.18,"B1Vnnpe        ","B1","Vnnpe     ",61.090164219999998,53.329047719999998,2.8200000000000003]
["HD 25539","","*  ","","",61.179462309999998,"4 4 43",32.571208499999997,"+32 34 16.35",6.8730000000000002,6.8739999999999997,"B3V            ","B3","V         ",61.179462309999998,32.571208499999997,4.1260000000000003]
["HD 25517                 ",{"$f":"IF(LEFT(A690,2)=\"V*\",\"var\",\"\")","v":""},"*  ","","",61.282702550000003,"4 5 7.8",44.278241039999997," 44 16 41.66",9.44,9.25,"B1V            ","B1","V         ",61.282702550000003,44.278241039999997,1.75]
["HD 25443","","*  ","","",61.533596600000003,"4 6 8",62.101833069999998,"+62 6 6.59",6.9939999999999998,6.7839999999999998,"B0.5III        ","B0","III       ",61.533596600000003,62.101833069999998,4.2160000000000002]
["HD 25799","","*  ","","",61.662678200000002,"4 6 39",32.385055600000001,"+32 23 6.2",7.11,7.02,"B3V...         ","B3","V...      ",61.662678200000002,32.385055600000001,3.9800000000000004]
["AG Per","Var","Al*",null,"",61.732616059999998,"4 6 55.8",33.446370700000003,"+33 26 46.93",6.73,6.69,"B5V:p...        ","B5","V:p...    ",61.732616059999998,33.446370700000003,4.3099999999999996]
["AG Per","Var","Al*",null,"",61.732616059999998,"4 6 55.8",33.446370700000003,"+33 26 46.93",6.73,6.69,"B5V:p...        ","B5","V:p...    ",61.732616059999998,33.446370700000003,4.3099999999999996]
["Cl* NGC 1502 HG 30       ",{"$f":"IF(LEFT(A695,2)=\"V*\",\"var\",\"\")","v":""},"*iC","","",61.88458,"4 7 32.2",62.320189999999997," 62 19 12.68",10.23,9.66,"B1V            ","B1","V         ",61.88458,62.320189999999997,1.3399999999999999]
["CCDM J04078+6220J","","*i*",null,"",61.922976200000001,"4 7 41.5",62.333084200000002,"+62 19 59.1",10.119999999999999,9.7799999999999994,"B8V            ","B8","V         ",61.922976200000001,62.333084200000002,1.2200000000000006]
["BD+61 675                ",{"$f":"IF(LEFT(A697,2)=\"V*\",\"var\",\"\")","v":""},"V* ","","",61.9336658,"4 7 44",62.301143600000003," 62 18 4.11",10.16,9.61,"B1Vn           ","B1","Vn        ",61.9336658,62.301143600000003,1.3900000000000006]
["HD 25787","","*  ","","",61.938050619999999,"4 7 45.1",51.452805179999999,"+51 27 10.09",7.65,7.64,"B2V            ","B2","V         ",61.938050619999999,51.452805179999999,3.3600000000000003]
["SZ Cam","Var","bL*","","",61.955384459999998,"4 7 49.2",62.332937569999999,"+62 19 58.57",7.26,6.93,"B0III+...      ","B0","III+...   ",61.955384459999998,62.332937569999999,4.07]
["HR 1260","","*i*","","",61.964153959999997,"4 7 51.3",62.330054609999998,"+62 19 48.19",7.24,6.86,"B0III          ","B0","III       ",61.964153959999997,62.330054609999998,4.1399999999999997]
["HD 26039","","*  ",null,"",61.977783170000002,"4 7 54.6",16.530611220000001,"+16 31 50.2",7.72,7.62,"B9m            ","B9","m         ",61.977783170000002,16.530611220000001,3.38]
["c Per","","Be*",null,"Be",62.165384000000003,"4 8 39.6",47.712511929999998,"+47 42 45.04",3.9670000000000001,4.0030000000000001,"B3Ve           ","B3","Ve        ",62.165384000000003,47.712511929999998,6.9969999999999999]
["HD 26398","","Be*",null,"Be",62.764153950000001,"4 11 3.3",16.646981360000002,"+16 38 49.13",7.31,6.98,"B7III          ","B7","III       ",62.764153950000001,16.646981360000002,4.0199999999999996]
["V1137 Tau","Var","a2*",null,"",63.213523809999998,"4 12 51.2",22.413458779999999,"+22 24 48.45",6.3049999999999997,6.1529999999999996,"B9IIIsp...     ","B9","IIIsp...  ",63.213523809999998,22.413458779999999,4.8470000000000004]
["HR 1307","","*iN",null,"",63.39402991,"4 13 34.5",10.21245687,"+10 12 44.84",6.266,6.2469999999999999,"B8Vn           ","B8","Vn        ",63.39402991,10.21245687,4.7530000000000001]
["HR 1315","","*  ",null,"",63.650969760000002,"4 14 36.2",10.011403570000001,"+10 0 41.05",5.1239999999999997,5.2080000000000002,"B9Vn           ",{"$f":"+LEFT(L706,2)","v":"B9"},{"$f":"+IF(MID(L706,3,1)=\".\",MID(L706,5,10),MID(L706,3,10))","v":"Vn        "},63.650969760000002,10.011403570000001,{"$f":"11-K706","v":5.7919999999999998}]
["49 Tau","","*  ",null,"",63.883569459999997,"4 15 32",8.8923562399999998,"+8 53 32.48",4.2140000000000004,4.28,"B3IV           ","B3","IV        ",{"$f":"+F707","v":63.883569459999997},{"$f":"+H707","v":8.8923562399999998},6.72]
["HR 1305","","*  ",null,"",64.223153359999998,"4 16 53.5",61.849991600000003,"+61 50 59.96",5.5609999999999999,5.6760000000000002,"B5Vn            ","B5","Vn        ",64.223153359999998,61.849991600000003,5.3239999999999998]
["HR 1305","","*  ",null,"",64.223153359999998,"4 16 53.5",61.849991600000003,"+61 50 59.96",5.5609999999999999,5.6760000000000002,"B5Vn            ","B5","Vn        ",64.223153359999998,61.849991600000003,5.3239999999999998]
["V545 Per","Var","LP*",null,"",64.533794499999999,"4 18 8.1",42.141157540000002,"+42 8 28.16",6.1390000000000002,6.1980000000000004,"B9V            ","B9","V         ",64.533794499999999,42.141157540000002,4.8019999999999996]
["V1024 Tau","Var","a2*",null,"",64.858739130000004,"4 19 26",21.142308669999998,"+21 8 32.31",5.4210000000000003,5.49,"B9IV           ","B9","IV        ",64.858739130000004,21.142308669999998,5.51]
["HR 1333","","V* ","","",65.047972119999997,"4 20 11.5",50.920933179999999,"+50 55 15.35",5.5119999999999996,5.5460000000000003,"B1.5IV         ","B1","IV        ",65.047972119999997,50.920933179999999,5.4539999999999997]
["V469 Per","Var","bC*",null,"",65.388189859999997,"4 21 33.1",46.498876500000001,"+46 29 55.95",4.7670000000000003,4.8140000000000001,"B4IV           ","B4","IV        ",65.388189859999997,46.498876500000001,6.1859999999999999]
["chi Tau","","SB*",null,"",65.645595529999994,"4 22 34.9",25.629316070000002,"+25 37 45.53",5.3470000000000004,5.3760000000000003,"B9Vnn          ","B9","Vnn       ",65.645595529999994,25.629316070000002,5.6239999999999997]
["V1141 Tau","Var","LP*",null,"",65.884860720000006,"4 23 32.3",20.982044989999999,"+20 58 55.36",6.0179999999999998,5.9960000000000004,"B8IV-V         ","B8","IV-V      ",65.884860720000006,20.982044989999999,5.0039999999999996]
["62 Tau","","*i*",null,"",65.999010310000003,"4 23 59.7",24.300989919999999,"+24 18 3.56",6.4939999999999998,6.3330000000000002,"B3V            ","B3","V         ",65.999010310000003,24.300989919999999,4.6669999999999998]
["V590 Per","Var","bL*",null,"",66.103555920000005,"4 24 24.8",34.314755949999999,"+34 18 53.12",7.31,7.3,"B8V            ","B8","V         ",66.103555920000005,34.314755949999999,3.7]
["55 Per","","*  ",null,"",66.121481209999999,"4 24 29.1",34.130758129999997,"+34 7 50.72",5.6680000000000001,5.7220000000000004,"B8V            ","B8","V         ",66.121481209999999,34.130758129999997,5.2779999999999996]
["HD 27877","","*  ",null,"",66.179009109999996,"4 24 42.9",18.913069549999999,"+18 54 47.05",7.71,7.36,"B8V            ","B8","V         ",66.179009109999996,18.913069549999999,3.6399999999999997]
["HD 27795                 ",{"$f":"IF(LEFT(A720,2)=\"V*\",\"var\",\"\")","v":""},"*  ","","",66.371386400000006,"4 25 29.1",46.143703629999997," 46 8 37.33",7.6369999999999996,7.4240000000000004,"B1V            ","B1","V         ",66.371386400000006,46.143703629999997,3.5759999999999996]
["HD 27846","","Be*","","Be",66.458358809999993,"4 25 50",46.23385605,"+46 14 1.88",8.36,8.09,"B1.5V          ","B1","V         ",66.458358809999993,46.23385605,2.91]
["HD 28087","","*  ",null,"",66.484196949999998,"4 25 56.2",1.03177483,"+1 1 54.38",7.29,7.37,"B8V            ","B8","V         ",66.484196949999998,1.03177483,3.63]
["V1143 Tau","Var","bC*",null,"",66.587926469999999,"4 26 21.1",8.5902668099999993,"+8 35 24.96",6.0540000000000003,6.0670000000000002,"B6IV           ","B6","IV        ",66.587926469999999,8.5902668099999993,4.9329999999999998]
["72 Tau","","*  ",null,"",66.822697230000003,"4 27 17.4",22.996333669999999,"+22 59 46.8",5.4210000000000003,5.5149999999999997,"B7V            ","B7","V         ",66.822697230000003,22.996333669999999,5.4850000000000003]
["HR 1289","","Be*",null,"Be",67.05530358,"4 28 13.2",83.80779072,"+83 48 28.04",5.3949999999999996,5.5,"B5V             ","B5","V         ",67.05530358,83.80779072,5.5]
["HR 1289","","Be*",null,"Be",67.05530358,"4 28 13.2",83.80779072,"+83 48 28.04",5.3949999999999996,5.5,"B5V             ","B5","V         ",67.05530358,83.80779072,5.5]
["HR 1415","","*  ","","",67.133831950000001,"4 28 32.1",1.3808216,"+1 22 50.95",5.4269999999999996,5.5279999999999996,"B3V            ","B3","V         ",67.133831950000001,1.3808216,5.4720000000000004]
["BD+56 924","","*  ",null,"",67.263000000000005,"4 29 3.1",56.984999999999999,"+56 59 5.99",null,9.65,"B3III          ","B3","III       ",67.263000000000005,56.984999999999999,1.3499999999999996]
["V1144 Tau","Var","LP*",null,"",67.428564069999993,"4 29 42.8",10.52185929,"+10 31 18.69",6.8559999999999999,6.7750000000000004,"B5V             ","B5","V         ",67.428564069999993,10.52185929,4.2249999999999996]
["V1144 Tau","Var","LP*",null,"",67.428564069999993,"4 29 42.8",10.52185929,"+10 31 18.69",6.8559999999999999,6.7750000000000004,"B5V             ","B5","V         ",67.428564069999993,10.52185929,4.2249999999999996]
["HD 28436","","*  ",null,"",67.450517230000003,"4 29 48.1",17.677598759999999,"+17 40 39.35",7.93,7.76,"B7V            ","B7","V         ",67.450517230000003,17.677598759999999,3.24]
["HD 28482","","*  ",null,"",67.593507750000001,"4 30 22.4",23.588857789999999,"+23 35 19.88",7.53,7.19,"B8III          ","B8","III       ",67.593507750000001,23.588857789999999,3.8099999999999996]
["HR 1424","","*i*",null,"",67.850399620000005,"4 31 24",40.010179280000003,"+40 0 36.64",6.3,6.26,"B8V            ","B8","V         ",67.850399620000005,40.010179280000003,4.74]
["BD+39 1013B","","*i*",null,"",67.853416999999993,"4 31 24.8",40.009264000000002,"+40 0 33.35",7.23,7.18,"B8V            ","B8","V         ",67.853416999999993,40.009264000000002,3.8200000000000003]
["HD 28715","","*  ",null,"",67.960202600000002,"4 31 50.4",5.7644499199999997,"+5 45 52.01",6.66,6.67,"B9V            ","B9","V         ",67.960202600000002,5.7644499199999997,4.33]
["DL Cam","Var","bC*","","",68.007676119999999,"4 32 1.8",53.91084583,"+53 54 39.04",5.8760000000000003,5.7720000000000002,"B0III          ","B0","III       ",68.007676119999999,53.91084583,5.2279999999999998]
["HD 283677","","*  ",null,"",68.045578340000006,"4 32 10.9",29.015577390000001,"+29 0 56.07",9.6199999999999992,9.19,"B5V             ","B5","V         ",68.045578340000006,29.015577390000001,1.8100000000000005]
["HD 283677","","*  ",null,"",68.045578340000006,"4 32 10.9",29.015577390000001,"+29 0 56.07",9.6199999999999992,9.19,"B5V             ","B5","V         ",68.045578340000006,29.015577390000001,1.8100000000000005]
["HD 28696","","*  ",null,"",68.170146000000003,"4 32 40.8",31.405011269999999,"+31 24 18.04",9.0399999999999991,8.69,"B8III          ","B8","III       ",68.170146000000003,31.405011269999999,2.3100000000000005]
["HD 28867","","TT?",null,"",68.387704799999995,"4 33 33",18.016719250000001,"+18 1 0.18",7.03,7.0129999999999999,"B9IVn          ","B9","IVn       ",68.387704799999995,18.016719250000001,3.9870000000000001]
["HD 283701","","*  ",null,"",68.729069600000003,"4 34 54.9",27.203106699999999,"+27 12 11.18",10.44,9.73,"B8III          ","B8","III       ",68.729069600000003,27.203106699999999,1.2699999999999996]
["BD+45 961","","Em*","Em","",68.917900000000003,"4 35 40.2",45.537199999999999,"+45 32 13.91",9.5,9.5,"B8ne           ","B8","ne        ",68.917900000000003,45.537199999999999,1.5]
["BD+44 993","","*  ",null,"",69.077231699999999,"4 36 18.5",44.836336699999997,"+44 50 10.81",10,9.76,"B8V            ","B8","V         ",69.077231699999999,44.836336699999997,1.2400000000000002]
["49 Eri","","V* ",null,"",69.306975370000004,"4 37 13.6",0.99831344,"+0 59 53.92",5.2009999999999996,5.3070000000000004,"B7V            ","B7","V         ",69.306975370000004,0.99831344,5.6929999999999996]
["HD 232980","","*  ","","",69.434272899999996,"4 37 44.2",53.462673100000004,"+53 27 45.62",9.2799999999999994,8.7899999999999991,"B0V            ","B0","V         ",69.434272899999996,53.462673100000004,2.2100000000000009]
["HD 29180","","*  ","","",69.450823799999995,"4 37 48.1",44.696876099999997,"+44 41 48.75",8.4700000000000006,8.33,"B2V            ","B2","V         ",69.450823799999995,44.696876099999997,2.67]
["V1148 Tau","Var","El*",null,"",69.47640844,"4 37 54.3",7.3176310400000002,"+7 19 3.47",6.97,7.02,"B3V            ","B3","V         ",69.47640844,7.3176310400000002,3.9800000000000004]
["HD 29309","","*  ","","",69.563474260000007,"4 38 15.2",31.998789469999998,"+31 59 55.64",7.4,7.14,"B2V            ","B2","V         ",69.563474260000007,31.998789469999998,3.8600000000000003]
["HU Tau","Var","Al*",null,"",69.565958359999996,"4 38 15.8",20.684722669999999,"+20 41 5",5.8380000000000001,5.8570000000000002,"B8V+F5III-IV   ","B8","V+F5III-IV",69.565958359999996,20.684722669999999,5.1429999999999998]
["HD 29441","","Be*","","Be",69.651001649999998,"4 38 36.2",8.1751721400000008,"+8 10 30.61",7.6,7.63,"B2.5Vne        ","B2","Vne       ",69.651001649999998,8.1751721400000008,3.37]
["BD+44 1000","","*  ",null,"",69.7850179,"4 39 8.4",44.596691700000001,"+44 35 48.09",10.210000000000001,9.9499999999999993,"B7V            ","B7","V         ",69.7850179,44.596691700000001,1.0500000000000007]
["HD 29373","","Be*",null,"Be",69.887455610000004,"4 39 32.9",43.659196520000002,"+43 39 33.1",8.69,8.5,"B6V            ","B6","V         ",69.887455610000004,43.659196520000002,2.5]
["HD 283794","","*  ",null,"",69.964024199999997,"4 39 51.3",27.188951400000001,"+27 11 20.22",10.050000000000001,9.66,"B9V            ","B9","V         ",69.964024199999997,27.188951400000001,1.3399999999999999]
["BD+44 1003","","*  ",null,"",69.964172099999999,"4 39 51.4",44.955582800000002,"+44 57 20.09",9.94,9.49,"B8V            ","B8","V         ",69.964172099999999,44.955582800000002,1.5099999999999998]
["93 Tau","","*  ",null,"",70.014242870000004,"4 40 3.4",12.19760945,"+12 11 51.39",5.327,5.4459999999999997,"B8IV           ","B8","IV        ",70.014242870000004,12.19760945,5.5540000000000003]
["HD 29487","","*  ",null,"",70.15065147,"4 40 36.1",44.097063200000001,"+44 5 49.42",7.63,7.47,"B8V            ","B8","V         ",70.15065147,44.097063200000001,3.5300000000000002]
["HD 232987","","*  ","","",70.184968769999998,"4 40 44.3",52.616736940000003,"+52 37 0.25",9.2100000000000009,9.08,"B3V            ","B3","V         ",70.184968769999998,52.616736940000003,1.92]
["HD 29371","","*  ",null,"",70.206417459999997,"4 40 49.5",57.879618569999998,"+57 52 46.62",7.38,7.26,"B9V            ","B9","V         ",70.206417459999997,57.879618569999998,3.74]
["HD 29647","","*  ",null,"",70.283525429999997,"4 41 8",25.992763010000001,"+25 59 33.94",9.26,8.4600000000000009,"B8III          ","B8","III       ",70.283525429999997,25.992763010000001,2.5399999999999991]
["HD 29681","","*  ",null,"",70.349519599999994,"4 41 23.8",22.6767997,"+22 40 36.47",9.7799999999999994,9.67,"B8V            ","B8","V         ",70.349519599999994,22.6767997,1.33]
["HD 29580","","V* ",null,"",70.392243800000003,"4 41 34.1",44.4965975,"+44 29 47.75",8.84,8.49,"B9p            ","B9","p         ",70.392243800000003,44.4965975,2.5099999999999998]
["tau Tau","","SB*","","",70.561256709999995,"4 42 14.7",22.956922599999999,"+22 57 24.92",4.1520000000000001,4.2640000000000002,"B3V            ","B3","V         ",70.561256709999995,22.956922599999999,6.7359999999999998]
["BD+22 739A","","*i*",null,"",70.561257999999995,"4 42 14.7",22.956942000000002,"+22 57 24.99",4.1100000000000003,4.24,"B3V            ","B3","V         ",70.561257999999995,22.956942000000002,6.76]
["BD+45 973","","*  ","","",70.758220750000007,"4 43 1.9",45.630399420000003,"+45 37 49.43",9.0399999999999991,8.6300000000000008,"B3V            ","B3","V         ",70.758220750000007,45.630399420000003,2.3699999999999992]
["HR 1493","","*i*","","",70.839975409999994,"4 43 21.5",49.973789799999999,"+49 58 25.64",5.8689999999999998,5.8609999999999998,"B9III          ","B9","III       ",70.839975409999994,49.973789799999999,5.1390000000000002]
["BD+44 1012               ",{"$f":"IF(LEFT(A766,2)=\"V*\",\"var\",\"\")","v":""},"*  ","","",71.0294746,"4 44 7",45.240042799999998," 45 14 24.15",9.7100000000000009,9.2799999999999994,"B1V            ","B1","V         ",71.0294746,45.240042799999998,1.7200000000000006]
["HR 1500","","Be*",null,"Be",71.054250710000005,"4 44 13",40.78645092,"+40 47 11.22",6.1280000000000001,6.0960000000000001,"B8IVne         ","B8","IVne      ",71.054250710000005,40.78645092,4.9039999999999999]
["HD 232999                ",{"$f":"IF(LEFT(A768,2)=\"V*\",\"var\",\"\")","v":""},"V* ","","",71.1715892,"4 44 41.1",50.533816700000003," 50 32 1.74",9.8000000000000007,9.36,"B1IV           ","B1","IV        ",71.1715892,50.533816700000003,1.6400000000000006]
["HD 30112","","*  ","","",71.175549759999996,"4 44 42.1",0.56809874999999999,"+0 34 5.15",7.05,7.22,"B2.5V          ","B2","V         ",71.175549759999996,0.56809874999999999,3.7800000000000002]
["HD 29900","","*  ",null,"",71.207016300000006,"4 44 49.6",46.387754700000002,"+46 23 15.91",9.5,9.2100000000000009,"B9V            ",{"$f":"+LEFT(L770,2)","v":"B9"},{"$f":"+IF(MID(L770,3,1)=\".\",MID(L770,5,10),MID(L770,3,10))","v":"V         "},71.207016300000006,46.387754700000002,{"$f":"11-K770","v":1.7899999999999991}]
["HD 30123","","Em*","Em","",71.394528120000004,"4 45 34.6",19.328305159999999,"+19 19 41.89",8.9700000000000006,8.61,"B8III          ","B8","III       ",{"$f":"+F771","v":71.394528120000004},{"$f":"+H771","v":19.328305159999999},2.3900000000000006]
["HR 1512","","*  ",null,"",71.426949359999995,"4 45 42.4",23.6279954,"+23 37 40.78",6.3869999999999996,6.3380000000000001,"B5III           ","B5","III       ",71.426949359999995,23.6279954,4.6619999999999999]
["HR 1512","","*  ",null,"",71.426949359999995,"4 45 42.4",23.6279954,"+23 37 40.78",6.3869999999999996,6.3380000000000001,"B5III           ","B5","III       ",71.426949359999995,23.6279954,4.6619999999999999]
["HD 30004","","*  ",null,"",71.455793700000001,"4 45 49.3",43.391782800000001,"+43 23 30.41",8.9700000000000006,8.77,"B3V            ","B3","V         ",71.455793700000001,43.391782800000001,2.2300000000000004]
["HD 276738","","Be*",null,"Be",71.463836200000003,"4 45 51.3",43.994393600000002,"+43 59 39.81",9.93,9.6999999999999993,"B7V            ","B7","V         ",71.463836200000003,43.994393600000002,1.3000000000000007]
["HD 282485","","*  ","","",71.658883700000004,"4 46 38.1",29.3177181,"+29 19 3.78",10.1,9.77,"B9V            ","B9","V         ",71.658883700000004,29.3177181,1.2300000000000004]
["HD 30263","","*iC",null,"",71.728050400000001,"4 46 54.7",19.0802136,"+19 4 48.76",9.2200000000000006,9.06,"B8III          ","B8","III       ",71.728050400000001,19.0802136,1.9399999999999995]
["BD+45 982","","*  ",null,"",71.747754200000003,"4 46 59.4",46.019709400000004,"+46 1 10.95",10.02,9.66,"B7V            ","B7","V         ",71.747754200000003,46.019709400000004,1.3399999999999999]
["HD 283845","","*  ","","",71.967879600000003,"4 47 52.2",27.744441699999999,"+27 44 39.99",10.01,9.56,"B3V            ","B3","V         ",71.967879600000003,27.744441699999999,1.4399999999999995]
["HD 30409","","*  ",null,"",72.360555910000002,"4 49 26.5",44.239627429999999,"+44 14 22.65",8.3800000000000008,8.33,"B9V            ","B9","V         ",72.360555910000002,44.239627429999999,2.67]
["HD 30677                 ",{"$f":"IF(LEFT(A781,2)=\"V*\",\"var\",\"\")","v":""},"*  ","","",72.515057229999996,"4 50 3.6",8.4078448100000003," 8 24 28.24",6.82,6.84,"B1II-III((n))  ","B1","II-III((n)",72.515057229999996,8.4078448100000003,4.16]
["HD 30481","","*  ",null,"",72.542261699999997,"4 50 10.1",44.049889700000001,"+44 2 59.6",9.35,9.2200000000000006,"B5V             ","B5","V         ",72.542261699999997,44.049889700000001,1.7799999999999994]
["HD 30481","","*  ",null,"",72.542261699999997,"4 50 10.1",44.049889700000001,"+44 2 59.6",9.35,9.2200000000000006,"B5V             ","B5","V         ",72.542261699999997,44.049889700000001,1.7799999999999994]
["HD 30675","","*  ","","",72.716682879999993,"4 50 52",28.31406771,"+28 18 50.64",7.84,7.55,"B3V            ","B3","V         ",72.716682879999993,28.31406771,3.45]
["HD 30585","","*iC",null,"",72.721971199999999,"4 50 53.2",43.492255299999997,"+43 29 32.11",9.01,8.86,"B9V            ","B9","V         ",72.721971199999999,43.492255299999997,2.1400000000000006]
["ADS 3468 AB","","** ",null,"",72.770169999999993,"4 51 4.8",44.968829999999997,"+44 58 7.78",8.57,8.31,"B6V            ","B6","V         ",72.770169999999993,44.968829999999997,2.6899999999999995]
["BD+43 1092","","*iC",null,"",72.7750542,"4 51 6",43.846625000000003,"+43 50 47.85",9.82,9.7100000000000009,"B9p            ","B9","p         ",72.7750542,43.846625000000003,1.2899999999999991]
["3 Ori","","*  ","","",72.801519670000005,"4 51 12.3",5.6051034199999998,"+5 36 18.37",3.5,3.68,"B2III+...      ","B2","III+...   ",72.801519670000005,5.6051034199999998,7.32]
["HD 30650","","*iC",null,"",72.885784599999994,"4 51 32.5",43.578133299999998,"+43 34 41.27",7.46,7.48,"B6V            ","B6","V         ",72.885784599999994,43.578133299999998,3.5199999999999996]
["HR 1553","","*  ",null,"",72.93076705,"4 51 43.3",9.9750772300000001,"+9 58 30.27",6.1630000000000003,6.1070000000000002,"B5V             ","B5","V         ",72.93076705,9.9750772300000001,4.8929999999999998]
["HR 1553","","*  ",null,"",72.93076705,"4 51 43.3",9.9750772300000001,"+9 58 30.27",6.1630000000000003,6.1070000000000002,"B5V             ","B5","V         ",72.93076705,9.9750772300000001,4.8929999999999998]
["HD 283920","","*  ",null,"",73.021685000000005,"4 52 5.2",26.917266399999999,"+26 55 2.15",9.64,9.16,"B7III          ","B7","III       ",73.021685000000005,26.917266399999999,1.8399999999999999]
["BD+44 1042","","*  ",null,"",73.256079600000007,"4 53 1.4",44.937241100000001,"+44 56 14.06",10.26,9.91,"B6V            ","B6","V         ",73.256079600000007,44.937241100000001,1.0899999999999999]
["HD 30883","","*  ",null,"",73.331364559999997,"4 53 19.5",42.11241587,"+42 6 44.69",8.94,8.84,"B9V            ","B9","V         ",73.331364559999997,42.11241587,2.16]
["BD+43 1110","","*  ",null,"",73.453817900000004,"4 53 48.9",44.088840599999997,"+44 5 19.82",9.66,9.35,"B8V            ","B8","V         ",73.453817900000004,44.088840599999997,1.6500000000000004]
["HD 31120","","*  ",null,"",73.539369199999996,"4 54 9.4",23.0662272,"+23 3 58.41",9.09,8.92,"B9V            ","B9","V         ",73.539369199999996,23.0662272,2.08]
["pi.05 Ori","Var","El*",null,"",73.56290018,"4 54 15",2.4406730799999998,"+2 26 26.42",3.54,3.72,"B3III+...      ","B3","III+...   ",73.56290018,2.4406730799999998,7.2799999999999994]
["HD 283932","","*  ",null,"",73.677167499999996,"4 54 42.5",25.729055599999999,"+25 43 44.6",10.31,9.83,"B8V            ","B8","V         ",73.677167499999996,25.729055599999999,1.17]
["HR 1574","","*  ",null,"",73.711289440000002,"4 54 50.7",0.46716839999999998,"+0 28 1.8",5.86,5.9749999999999996,"B5V             ","B5","V         ",73.711289440000002,0.46716839999999998,5.0250000000000004]
["HR 1574","","*  ",null,"",73.711289440000002,"4 54 50.7",0.46716839999999998,"+0 28 1.8",5.86,5.9749999999999996,"B5V             ","B5","V         ",73.711289440000002,0.46716839999999998,5.0250000000000004]
["HD 277068","","*  ",null,"",73.806388299999995,"4 55 13.5",43.643293300000003,"+43 38 35.85",9.75,9.64,"B4III          ","B4","III       ",73.806388299999995,43.643293300000003,1.3599999999999994]
["HD 277069","","*  ",null,"",73.924213800000004,"4 55 41.8",43.6552036,"+43 39 18.73",9.83,9.43,"B9III          ","B9","III       ",73.924213800000004,43.6552036,1.5700000000000003]
["HD 31293","","Or*",null,"",73.941021719999995,"4 55 45.8",30.551190739999999,"+30 33 4.28",7.18,7.06,"B9neqIV-V      ","B9","neqIV-V   ",73.941021719999995,30.551190739999999,3.9400000000000004]
["HR 1576","","*  ",null,"",73.958974549999994,"4 55 50.1",15.040279,"+15 2 25",5.7009999999999996,5.7850000000000001,"B9V            ","B9","V         ",73.958974549999994,15.040279,5.2149999999999999]
["HD 31195","","*  ",null,"",73.977769019999997,"4 55 54.6",45.03475014,"+45 2 5.1",7.91,7.89,"B7V            ","B7","V         ",73.977769019999997,45.03475014,3.1100000000000003]
["HD 31206","","*  ",null,"",74.009794600000006,"4 56 2.3",43.966158900000003,"+43 57 58.17",9.36,9.2200000000000006,"B9V            ","B9","V         ",74.009794600000006,43.966158900000003,1.7799999999999994]
["HD 282633","","*  ",null,"",74.3621792,"4 57 26.9",30.1747719,"+30 10 29.17",9.94,9.7100000000000009,"B8V            ","B8","V         ",74.3621792,30.1747719,1.2899999999999991]
["BD+30 748","","*  ","","",74.639619600000003,"4 58 33.5",30.6976558,"+30 41 51.56",9.6199999999999992,9.3000000000000007,"B1.5V          ","B1","V         ",74.639619600000003,30.6976558,1.6999999999999993]
["HD 31747","","*i*",null,"",74.738360850000007,"4 58 57.2",14.549577169999999,"+14 32 58.47",7.6,7.55,"B6V            ","B6","V         ",74.738360850000007,14.549577169999999,3.45]
["HR 1600","","V* ",null,"",74.747545470000006,"4 58 59.4",14.543242019999999,"+14 32 35.67",6.1070000000000002,6.0609999999999999,"B7V            ","B7","V         ",74.747545470000006,14.543242019999999,4.9390000000000001]
["HD 31616","","*  ",null,"",74.837974200000005,"4 59 21.1",43.618707499999999,"+43 37 7.34",8.9,8.82,"B7V            ","B7","V         ",74.837974200000005,43.618707499999999,2.1799999999999997]
["HD 31617","","*  ","","",74.838537470000006,"4 59 21.2",43.323380270000001,"+43 19 24.16",7.4,7.4,"B2IV           ","B2","IV        ",74.838537470000006,43.323380270000001,3.5999999999999996]
["HD 277195","","*  ",null,"",74.898277500000006,"4 59 35.5",43.743057800000003,"+43 44 35",9.8699999999999992,9.65,"B7V            ","B7","V         ",74.898277500000006,43.743057800000003,1.3499999999999996]
["HD 31678","","*  ",null,"",74.963453299999998,"4 59 51.2",43.319110299999998,"+43 19 8.79",9.06,8.86,"B9V            ","B9","V         ",74.963453299999998,43.319110299999998,2.1400000000000006]
["HD 31806","","*i*",null,"",74.973957470000002,"4 59 53.7",27.325603350000002,"+27 19 32.17",7.11,6.96,"B7V            ","B7","V         ",74.973957470000002,27.325603350000002,4.04]
["HR 1609","","*i*",null,"",75.135540210000002,"5 0 32.5",3.6148060599999998,"+3 36 53.3",6.97,7.02,"B9Vn           ","B9","Vn        ",75.135540210000002,3.6148060599999998,3.9800000000000004]
["HR 1610","","V* ",null,"",75.141377469999995,"5 0 33.9",3.61574515,"+3 36 56.68",6.55,6.63,"B9Vn           ","B9","Vn        ",75.141377469999995,3.61574515,4.37]
["HD 277197                ",{"$f":"IF(LEFT(A818,2)=\"V*\",\"var\",\"\")","v":""},"*  ","","",75.298108299999996,"5 1 11.5",43.578309699999998," 43 34 41.91",9.5,9.4700000000000006,"B1IV           ","B1","IV        ",75.298108299999996,43.578309699999998,1.5299999999999994]
["HD 32018","","*  ","","",75.328822310000007,"5 1 18.9",26.534294190000001,"+26 32 3.45",7.93,7.52,"B2IV           ","B2","IV        ",75.328822310000007,26.534294190000001,3.4800000000000004]
["HD 31894","","*  ","","",75.392880289999994,"5 1 34.2",43.43572923,"+43 26 8.62",8.49,8.49,"B2IV-V         ","B2","IV-V      ",75.392880289999994,43.43572923,2.5099999999999998]
["HR 1619","","*i*",null,"",75.500101520000001,"5 2 0",1.6088641299999999,"+1 36 31.91",6.415,6.5010000000000003,"B8V            ","B8","V         ",75.500101520000001,1.6088641299999999,4.4989999999999997]
["HD 32190                 ",{"$f":"IF(LEFT(A822,2)=\"V*\",\"var\",\"\")","v":""},"Be*","","Be",75.566222769999996,"5 2 15.8",24.029163149999999," 24 1 44.98",8.4700000000000006,8.36,"B1Ve           ","B1","Ve        ",75.566222769999996,24.029163149999999,2.6400000000000006]
["BD+44 1080","","*iN",null,"",75.590476199999998,"5 2 21.7",44.269568900000003,"+44 16 10.44",9.91,9.2899999999999991,"B5V             ","B5","V         ",75.590476199999998,44.269568900000003,1.7100000000000009]
["BD+44 1080","","*iN",null,"",75.590476199999998,"5 2 21.7",44.269568900000003,"+44 16 10.44",9.91,9.2899999999999991,"B5V             ","B5","V         ",75.590476199999998,44.269568900000003,1.7100000000000009]
["BD+44 1081","","*  ",null,"",75.607448300000001,"5 2 25.7",44.657705,"+44 39 27.73",9.69,9.5299999999999994,"B8V            ","B8","V         ",75.607448300000001,44.657705,1.4700000000000006]
["HD 32091","","*  ","","",75.666645000000003,"5 2 39.9",42.503806699999998,"+42 30 13.7",9.1,9.2100000000000009,"B3III          ","B3","III       ",75.666645000000003,42.503806699999998,1.7899999999999991]
["HD 32359","","*  ",null,"",75.685639280000004,"5 2 44.5",3.4577050200000001,"+3 27 27.73",7.22,7.3,"B9V            ","B9","V         ",75.685639280000004,3.4577050200000001,3.7]
["HD 32050","","*  ","","",75.694365739999995,"5 2 46.6",46.660247269999999,"+46 39 36.89",7.75,7.74,"B9V            ","B9","V         ",75.694365739999995,46.660247269999999,3.26]
["HD 284093","","*  ",null,"",75.762270400000006,"5 3 2.9",24.8460492,"+24 50 45.77",9.91,9.6,"B8V            ","B8","V         ",75.762270400000006,24.8460492,1.4000000000000004]
["HD 32431","","*  ",null,"",75.821259080000004,"5 3 17.1",4.0155566599999997,"+4 0 56",7.97,8.08,"B8V            ","B8","V         ",75.821259080000004,4.0155566599999997,2.92]
["HD 32198","","*  ",null,"",75.854955799999999,"5 3 25.1",43.331276899999999,"+43 19 52.59",9.4700000000000006,9.2799999999999994,"B8V            ","B8","V         ",75.854955799999999,43.331276899999999,1.7200000000000006]
["HD 32282","","*  ",null,"",75.974887150000001,"5 3 53.9",40.683303889999998,"+40 40 59.89",8.07,8.08,"B8V            ","B8","V         ",75.974887150000001,40.683303889999998,2.92]
["HD 277342","","*  ",null,"",76.064802900000004,"5 4 15.5",42.320426099999999,"+42 19 13.53",9.4700000000000006,9.41,"B8V            ","B8","V         ",76.064802900000004,42.320426099999999,1.5899999999999999]
["HD 32330","","*  ","","",76.079862500000004,"5 4 19.1",41.602292499999997,"+41 36 8.25",8.93,8.9499999999999993,"B2IV           ",{"$f":"+LEFT(L834,2)","v":"B2"},{"$f":"+IF(MID(L834,3,1)=\".\",MID(L834,5,10),MID(L834,3,10))","v":"IV        "},76.079862500000004,41.602292499999997,{"$f":"11-K834","v":2.0500000000000007}]
["HD 32481","","*  ","","",76.091937669999993,"5 4 22",21.643547120000001,"+21 38 36.76",8.2799999999999994,7.96,"B3V            ","B3","V         ",{"$f":"+F835","v":76.091937669999993},{"$f":"+H835","v":21.643547120000001},3.04]
["HD 32328","","*  ",null,"",76.136379649999995,"5 4 32.7",43.727656709999998,"+43 43 39.56",7.59,7.64,"B8V            ","B8","V         ",76.136379649999995,43.727656709999998,3.3600000000000003]
["HD 32358","","Be*",null,"Be",76.183975450000005,"5 4 44.1",44.95860854,"+44 57 30.99",9.57,9.34,"B6V            ","B6","V         ",76.183975450000005,44.95860854,1.6600000000000001]
["HD 277326","","*  ",null,"",76.185389999999998,"5 4 44.4",43.119009699999999,"+43 7 8.43",9.82,9.76,"B8III          ","B8","III       ",76.185389999999998,43.119009699999999,1.2400000000000002]
["BF Aur","Var","bL*",null,"",76.264576099999999,"5 5 3.4",41.288640399999998,"+41 17 19.1",8.83,8.85,"B5V...          ","B5","V...      ",76.264576099999999,41.288640399999998,2.1500000000000004]
["BF Aur","Var","bL*",null,"",76.264576099999999,"5 5 3.4",41.288640399999998,"+41 17 19.1",8.83,8.85,"B5V...          ","B5","V...      ",76.264576099999999,41.288640399999998,2.1500000000000004]
["HD 32417","","*  ",null,"",76.283094599999998,"5 5 7.9",42.707627799999997,"+42 42 27.46",9.69,9.6199999999999992,"B6V            ","B6","V         ",76.283094599999998,42.707627799999997,1.3800000000000008]
["HD 32446","","*  ",null,"",76.355696739999999,"5 5 25.3",45.058173420000003,"+45 3 29.42",8.42,8.2799999999999994,"B5III           ","B5","III       ",76.355696739999999,45.058173420000003,2.7200000000000006]
["HD 32446","","*  ",null,"",76.355696739999999,"5 5 25.3",45.058173420000003,"+45 3 29.42",8.42,8.2799999999999994,"B5III           ","B5","III       ",76.355696739999999,45.058173420000003,2.7200000000000006]
["HD 32816","","*  ",null,"",76.477536299999997,"5 5 54.6",1.8522158900000001,"+1 51 7.97",8.19,8.16,"B8V            ","B8","V         ",76.477536299999997,1.8522158900000001,2.84]
["HZ Aur","Var","a2*",null,"",76.534833320000004,"5 6 8.3",33.918689000000001,"+33 55 7.28",7.03,7.07,"B9p            ","B9","p         ",76.534833320000004,33.918689000000001,3.9299999999999997]
["11 Cam","","Be*","","Be",76.535214929999995,"5 6 8.4",58.972371889999998,"+58 58 20.53",5,5.03,"B2.5Ve         ","B2","Ve        ",76.535214929999995,58.972371889999998,5.97]
["HD 32867","","*  ",null,"",76.595461380000003,"5 6 22.9",2.6732605600000001,"+2 40 23.73",7.37,7.48,"B8V            ","B8","V         ",76.595461380000003,2.6732605600000001,3.5199999999999996]
["eta Aur","","V* ","","",76.628722389999993,"5 6 30.8",41.234475760000002,"+41 14 4.11",3.012,3.1579999999999999,"B3V            ","B3","V         ",76.628722389999993,41.234475760000002,7.8420000000000005]
["HD 32672","","*  ","","",76.642886860000004,"5 6 34.2",38.522245400000003,"+38 31 20.08",7.87,7.77,"B2IV           ","B2","IV        ",76.642886860000004,38.522245400000003,3.2300000000000004]
["HD 33007","","*  ",null,"",76.841789430000006,"5 7 22",2.4484607299999999,"+2 26 54.45",8.7100000000000009,8.6999999999999993,"B9V            ","B9","V         ",76.841789430000006,2.4484607299999999,2.3000000000000007]
["HD 33038","","*  ",null,"",76.895309499999996,"5 7 34.8",2.46912829,"+2 28 8.86",7.54,7.59,"B8V            ","B8","V         ",76.895309499999996,2.46912829,3.41]
["105 Tau","","Be*","","Be",76.980985200000006,"5 7 55.4",21.70482363,"+21 42 17.36",6.08,5.92,"B2Ve           ","B2","Ve        ",76.980985200000006,21.70482363,5.08]
["103 Tau","","*i*","","",77.027595450000007,"5 8 6.6",24.26517539,"+24 15 54.63",5.532,5.5039999999999996,"B2V            ","B2","V         ",77.027595450000007,24.26517539,5.4960000000000004]
["HD 33189","","*  ",null,"",77.156135469999995,"5 8 37.4",1.2763392899999999,"+1 16 34.82",8.6999999999999993,8.7100000000000009,"B9V            ","B9","V         ",77.156135469999995,1.2763392899999999,2.2899999999999991]
["HD 32989","","*i*","","",77.224788509999996,"5 8 53.9",39.488261479999998,"+39 29 17.74",8.0500000000000007,7.99,"B2IV           ","B2","IV        ",77.224788509999996,39.488261479999998,3.01]
["HD 33236","","*  ",null,"",77.233969139999999,"5 8 56.1",3.2187227799999998,"+3 13 7.4",6.65,6.52,"B8V            ","B8","V         ",77.233969139999999,3.2187227799999998,4.4800000000000004]
["TT Aur","Var","bL*","","",77.425957999999994,"5 9 42.2",39.586357999999997,"+39 35 10.88",9.26,9.19,"B2Vn           ","B2","Vn        ",77.425957999999994,39.586357999999997,1.8100000000000005]
["HD 33152                 ",{"$f":"IF(LEFT(A858,2)=\"V*\",\"var\",\"\")","v":""},"Be*","","Be",77.485134009999996,"5 9 56.4",37.004447409999997," 37 0 16.01",8.32,8.1300000000000008,"B1Ve           ","B1","Ve        ",77.485134009999996,37.004447409999997,2.8699999999999992]
["HD 33403","","*  ",null,"",77.520480340000006,"5 10 4.9",2.9359311400000001,"+2 56 9.35",8.31,8.31,"B9V            ","B9","V         ",77.520480340000006,2.9359311400000001,2.6899999999999995]
["HD 33483","","*  ",null,"",77.660533700000002,"5 10 38.5",1.3671244,"+1 22 1.64",8.85,8.8000000000000007,"B8V            ","B8","V         ",77.660533700000002,1.3671244,2.1999999999999993]
["HD 33232","","Be*","","Be",77.700846249999998,"5 10 48.2",41.002895469999999,"+41 0 10.42",8.27,8.24,"B2Vne          ","B2","Vne       ",77.700846249999998,41.002895469999999,2.76]
["HD 33467","","*  ",null,"",77.745841799999994,"5 10 59",14.92179571,"+14 55 18.46",8.02,7.93,"B9V            ","B9","V         ",77.745841799999994,14.92179571,3.0700000000000003]
["V1085 Ori","Var","a2*",null,"",77.922290840000002,"5 11 41.3",0.51457200000000003,"+0 30 52.45",6.6050000000000004,6.665,"B9Vn           ","B9","Vn        ",77.922290840000002,0.51457200000000003,4.335]
["BN Cam","Var","a2*",null,"",78.093553819999997,"5 12 22.4",73.946678410000004,"+73 56 48.04",5.32,5.45,"B9sp...        ","B9","sp...     ",78.093553819999997,73.946678410000004,5.55]
["HD 33604","","Be*","","Be",78.305557129999997,"5 13 13.3",40.193531049999997,"+40 11 36.71",7.36,7.38,"B2V:pe         ","B2","V:pe      ",78.305557129999997,40.193531049999997,3.62]
["HD 34100","","*  ",null,"",78.741820000000004,"5 14 58",0.43653189999999997,"+0 26 11.51",9.1999999999999993,9.23,"B8V            ","B8","V         ",78.741820000000004,0.43653189999999997,1.7699999999999996]
["HD 34054","","*  ",null,"",78.78765224,"5 15 9",15.06255693,"+15 3 45.2",7.62,7.47,"B9V            ","B9","V         ",78.78765224,15.06255693,3.5300000000000002]
["HD 34179","","*  ",null,"",78.840407029999994,"5 15 21.6",6.0332629999999998E-2,"+0 3 37.19",7.98,8.02,"B8V            ","B8","V         ",78.840407029999994,6.0332629999999998E-2,2.9800000000000004]
["HD 34163","","*  ",null,"",78.843381699999995,"5 15 22.4",1.0134289000000001,"+1 0 48.34",9.1300000000000008,8.98,"B8V            ","B8","V         ",78.843381699999995,1.0134289000000001,2.0199999999999996]
["HD 34078","","Or*","","",79.075625009999996,"5 16 18.1",34.3123182,"+34 18 44.34",6.18,5.9980000000000002,"O9.5Ve...        ","O9","Ve...     ",79.075625009999996,34.3123182,5.0019999999999998]
["HD 280814","","Em*","Em","",79.084569999999999,"5 16 20.2",35.394108299999999,"+35 23 38.78",9.4,9.19,"B3ne           ","B3","ne        ",79.084569999999999,35.394108299999999,1.8100000000000005]
["CCDM J05167+1826AB","","** ","","",79.182841260000004,"5 16 43.8",18.439536660000002,"+18 26 22.33",7.25,7.16,"B3V            ","B3","V         ",79.182841260000004,18.439536660000002,3.84]
["HD 242359","","*  ",null,"",79.412926200000001,"5 17 39.1",15.983185000000001,"+15 58 59.46",9.77,9.69,"B9V            ","B9","V         ",79.412926200000001,15.983185000000001,1.3100000000000005]
["AR Aur","Var","Al*",null,"",79.578751620000006,"5 18 18.9",33.767347880000003,"+33 46 2.45",6.0990000000000002,6.1429999999999998,"B9V+B9.5V      ","B9","V+B9.5V   ",79.578751620000006,33.767347880000003,4.8570000000000002]
["HD 34547","","*  ",null,"",79.720527799999999,"5 18 52.9",13.567176160000001,"+13 34 1.83",7.47,7.43,"B9V            ","B9","V         ",79.720527799999999,13.567176160000001,3.5700000000000003]
["HD 34637","","*  ",null,"",79.764548610000006,"5 19 3.4",0.43850159,"+0 26 18.6",9.42,9.39,"B9V            ","B9","V         ",79.764548610000006,0.43850159,1.6099999999999994]
["DV Cam","Var","Al*",null,"",79.866074350000005,"5 19 27.8",58.11736792,"+58 7 2.52",6.0880000000000001,6.1189999999999998,"B5V             ","B5","V         ",79.866074350000005,58.11736792,4.8810000000000002]
["DV Cam","Var","Al*",null,"",79.866074350000005,"5 19 27.8",58.11736792,"+58 7 2.52",6.0880000000000001,6.1189999999999998,"B5V             ","B5","V         ",79.866074350000005,58.11736792,4.8810000000000002]
["HD 34576","","*iA","","",80.047547559999998,"5 20 11.4",36.674635039999998,"+36 40 28.68",7.47,7.5,"B2V            ","B2","V         ",80.047547559999998,36.674635039999998,3.5]
["HD 34626","","Be*","","Be",80.137652950000003,"5 20 33",36.632230499999999,"+36 37 56.02",8.18,8.16,"B1.5IVnp       ","B1","IVnp      ",80.137652950000003,36.632230499999999,2.84]
["HD 34792","","*  ",null,"",80.148955689999994,"5 20 35.7",15.05931621,"+15 3 33.53",8.27,8.15,"B9V            ","B9","V         ",80.148955689999994,15.05931621,2.8499999999999996]
["HR 1750","","*  ",null,"",80.247231619999994,"5 20 59.3",27.957263510000001,"+27 57 26.14",6.37,6.33,"B9IV           ","B9","IV        ",80.247231619999994,27.957263510000001,4.67]
["HD 278091","","*  ","","",80.271037899999996,"5 21 5",39.319168300000001,"+39 19 9",10.14,9.81,"B2V            ","B2","V         ",80.271037899999996,39.319168300000001,1.1899999999999995]
["HR 1761","","Be*",null,"Be",80.330450519999999,"5 21 19.3",4.0119471799999999,"+4 0 43",6.41,6.52,"B5Vp            ","B5","Vp        ",80.330450519999999,4.0119471799999999,4.4800000000000004]
["HD 34906","","*  ","","",80.356049999999996,"5 21 25.4",16.028885299999999,"+16 1 43.98",9.32,9.1999999999999993,"B9V            ","B9","V         ",80.356049999999996,16.028885299999999,1.8000000000000007]
["HR 1763                  ",{"$f":"IF(LEFT(A886,2)=\"V*\",\"var\",\"\")","v":""},"*iN","","",80.431503219999996,"5 21 43.5",8.4285579100000003," 8 25 42.8",5.6559999999999997,5.7789999999999999,"B1V            ","B1","V         ",80.431503219999996,8.4285579100000003,5.2210000000000001]
["rho Aur","","*  ","","",80.451735429999999,"5 21 48.4",41.804572649999997,"+41 48 16.46",5.0730000000000004,5.2,"B3V            ","B3","V         ",80.451735429999999,41.804572649999997,5.8]
["HD 35051","","*  ",null,"",80.643681479999998,"5 22 34.4",16.803950870000001,"+16 48 14.22",8.4700000000000006,8.31,"B8V            ","B8","V         ",80.643681479999998,16.803950870000001,2.6899999999999995]
["HD 34921","","Be*","","Be",80.64679769,"5 22 35.2",37.67601002,"+37 40 33.63",7.58,7.45,"B0IVpe         ","B0","IVpe      ",80.64679769,37.67601002,3.55]
["HD 35135","","*  ",null,"",80.679646180000006,"5 22 43.1",0.13924241000000001,"+0 8 21.27",8.35,8.36,"B8V            ","B8","V         ",80.679646180000006,0.13924241000000001,2.6400000000000006]
["BD+44 1188","","*  ",null,"",80.684383299999993,"5 22 44.2",44.257527199999998,"+44 15 27.09",9.9600000000000009,9.8800000000000008,"B8IV           ","B8","IV        ",80.684383299999993,44.257527199999998,1.1199999999999992]
["ADS 3962 AB              ",{"$f":"IF(LEFT(A892,2)=\"V*\",\"var\",\"\")","v":""},"** ","","",80.709599999999995,"5 22 50.3",3.5478000000000001," 3 32 52.08",4.84,4.99,"B1Vn           ","B1","Vn        ",80.709599999999995,3.5478000000000001,6.01]
["HD 35148","","*i*","","",80.712652320000004,"5 22 51",3.5522184299999999,"+3 33 7.98",7.06,7.18,"B3Vn           ","B3","Vn        ",80.712652320000004,3.5522184299999999,3.8200000000000003]
["SS 26","","Em*","Em","",80.790000000000006,"5 23 9.6",35.608600000000003,"+35 36 30.96",null,9.1,"B5s             ","B5","s         ",80.790000000000006,35.608600000000003,1.9000000000000004]
["HD 35203","","*  ",null,"",80.792278609999997,"5 23 10.1",1.1396179500000001,"+1 8 22.62",7.9,7.98,"B6V            ","B6","V         ",80.792278609999997,1.1396179500000001,3.0199999999999996]
["22 Aur","","*  ",null,"",80.845303439999995,"5 23 22.8",28.936763410000001,"+28 56 12.34",6.42,6.46,"B9Vs           ",{"$f":"+LEFT(L896,2)","v":"B9"},{"$f":"+IF(MID(L896,3,1)=\".\",MID(L896,5,10),MID(L896,3,10))","v":"Vs        "},80.845303439999995,28.936763410000001,4.54]
["V1156 Ori","Var","Ro*","","",80.959826680000006,"5 23 50.3",2.0821750699999999,"+2 4 55.83",7.78,7.91,"B3Vw...        ","B3","Vw...     ",80.959826680000006,2.0821750699999999,3.09]
["HD 35305","","*  ",null,"",80.964071230000002,"5 23 51.3",0.86285856999999999,"+0 51 46.29",8.34,8.4,"B6.5IV-V       ","B6","IV-V      ",80.964071230000002,0.86285856999999999,{"$f":"11-K898","v":2.5999999999999996}]
["HD 243334","","*  ",null,"",81.076700799999998,"5 24 18.4",14.7954364,"+14 47 43.57",10.06,9.91,"B9V            ","B9","V         ",{"$f":"+F899","v":81.076700799999998},{"$f":"+H899","v":14.7954364},1.0899999999999999]
["HD 35215                 ",{"$f":"IF(LEFT(A900,2)=\"V*\",\"var\",\"\")","v":""},"*  ","","",81.118159199999994,"5 24 28.3",30.191911900000001," 30 11 30.88",9.49,9.42,"B1V            ","B1","V         ",81.118159199999994,30.191911900000001,1.58]
["HD 35329","","*  ",null,"",81.144775499999994,"5 24 34.7",15.97527275,"+15 58 30.98",8.6300000000000008,8.5,"B9V            ","B9","V         ",81.144775499999994,15.97527275,2.5]
["HR 1786","","*  ",null,"",81.150419729999996,"5 24 36.1",2.3531650700000002,"+2 21 11.39",6.1669999999999998,6.3049999999999997,"B4IVn          ","B4","IVn       ",81.150419729999996,2.3531650700000002,4.6950000000000003]
["HR 1776","","*  ",null,"",81.160497649999996,"5 24 38.5",31.14314882,"+31 8 35.33",5.9589999999999996,5.9320000000000004,"B9III          ","B9","III       ",81.160497649999996,31.14314882,5.0679999999999996]
["* 25 Ori                 ",{"$f":"IF(LEFT(A904,2)=\"V*\",\"var\",\"\")","v":""},"Be*","","Be",81.186777660000004,"5 24 44.8",1.84644553," 1 50 47.2",4.7009999999999996,4.8730000000000002,"B1Vpe          ","B1","Vpe       ",81.186777660000004,1.84644553,6.1269999999999998]
["HD 35349","","*  ",null,"",81.210583299999996,"5 24 50.5",17.1969764,"+17 11 49.11",7.58,7.59,"B5Vn            ","B5","Vn        ",81.210583299999996,17.1969764,3.41]
["HD 35349","","*  ",null,"",81.210583299999996,"5 24 50.5",17.1969764,"+17 11 49.11",7.58,7.59,"B5Vn            ","B5","Vn        ",81.210583299999996,17.1969764,3.41]
["BELLATRIX","","V* ","","",81.282763560000006,"5 25 7.8",6.3497032600000001,"+6 20 58.93",1.42,1.64,"B2III          ","B2","III       ",81.282763560000006,6.3497032600000001,9.36]
["HD 35395","","V* ","","",81.293230070000007,"5 25 10.3",20.583726009999999,"+20 35 1.41",6.968,6.7709999999999999,"B0.5III:       ","B0","III:      ",81.293230070000007,20.583726009999999,4.2290000000000001]
["CCDM J05252+0155AB","","** ",null,"",81.297497859999993,"5 25 11.3",1.9233356500000001,"+1 55 24",7.36,7.42,"B8V            ","B8","V         ",81.297497859999993,1.9233356500000001,3.58]
["HD 35345                 ",{"$f":"IF(LEFT(A910,2)=\"V*\",\"var\",\"\")","v":""},"Be*","","Be",81.436603300000002,"5 25 44.7",35.647199700000002," 35 38 49.91",8.5399999999999991,8.43,"B1Vpe          ","B1","Vpe       ",81.436603300000002,35.647199700000002,2.5700000000000003]
["HR 1803","","** ","","",81.445908500000002,"5 25 47",0.52024168999999998,"+0 31 12.87",5.9820000000000002,6.1449999999999996,"B2.5V          ","B2","V         ",81.445908500000002,0.52024168999999998,4.8550000000000004]
["HD 35522","","*  ",null,"",81.476486570000006,"5 25 54.3",15.453862559999999,"+15 27 13.9",7.54,7.55,"B9V            ","B9","V         ",81.476486570000006,15.453862559999999,3.45]
["HD 35533","","*  ",null,"",81.511193079999998,"5 26 2.6",15.671779620000001,"+15 40 18.4",7.55,7.54,"B9V            ","B9","V         ",81.511193079999998,15.671779620000001,3.46]
["113 Tau","","*  ","","",81.523845600000001,"5 26 5.7",16.700158760000001,"+16 42 0.57",6.1459999999999999,6.2290000000000001,"B2Vn           ","B2","Vn        ",81.523845600000001,16.700158760000001,4.7709999999999999]
["HD 35479","","*  ",null,"",81.560873389999998,"5 26 14.6",29.986663870000001,"+29 59 11.98",8.17,8.1199999999999992,"B9p            ","B9","p         ",81.560873389999998,29.986663870000001,2.8800000000000008]
["ELNATH","","*i*",null,"",81.572971330000001,"5 26 17.5",28.60745172,"+28 36 26.82",1.62,1.68,"B7III          ","B7","III       ",81.572971330000001,28.60745172,9.32]
["CCDM J05265+0256AB","","** ",null,"",81.630075390000002,"5 26 31.2",2.9359050099999999,"+2 56 9.25",6.5,6.5,"B9V            ","B9","V         ",81.630075390000002,2.9359050099999999,4.5]
["psi Ori","Var","bC*","","",81.709288709999996,"5 26 50.2",3.0956723099999999,"+3 5 44.42",4.3929999999999998,4.5949999999999998,"B2IV           ","B2","IV        ",81.709288709999996,3.0956723099999999,6.4050000000000002]
["HD 35730","","*  ",null,"",81.726151920000007,"5 26 54.2",3.6146735300000001,"+3 36 52.82",7.032,7.1749999999999998,"B5p             ","B5","p         ",81.726151920000007,3.6146735300000001,3.8250000000000002]
["HD 35730","","*  ",null,"",81.726151920000007,"5 26 54.2",3.6146735300000001,"+3 36 52.82",7.032,7.1749999999999998,"B5p             ","B5","p         ",81.726151920000007,3.6146735300000001,3.8250000000000002]
["HD 281151","","*iA","","",81.773588799999999,"5 27 5.6",34.325437800000003,"+34 19 31.57",9.59,9.48,"B0.5V          ","B0","V         ",81.773588799999999,34.325437800000003,1.5199999999999996]
["HD 35762","","*  ","","",81.784595800000005,"5 27 8.3",3.8555473899999999,"+3 51 19.97",6.5709999999999997,6.734,"B2V            ","B2","V         ",81.784595800000005,3.8555473899999999,4.266]
["115 Tau","","*  ",null,"",81.792056329999994,"5 27 10",17.9622177,"+17 57 43.98",5.3090000000000002,5.3979999999999997,"B5V             ","B5","V         ",81.792056329999994,17.9622177,5.6020000000000003]
["115 Tau","","*  ",null,"",81.792056329999994,"5 27 10",17.9622177,"+17 57 43.98",5.3090000000000002,5.3979999999999997,"B5V             ","B5","V         ",81.792056329999994,17.9622177,5.6020000000000003]
["HD 281150","","*i*","","",81.816379600000005,"5 27 15.9",34.428744199999997,"+34 25 43.47",9.73,9.61,"B0.5V          ","B0","V         ",81.816379600000005,34.428744199999997,1.3900000000000006]
["HD 35834","","*  ",null,"",81.903653860000006,"5 27 36.8",1.1075901399999999,"+1 6 27.32",7.62,7.67,"B8V            ","B8","V         ",81.903653860000006,1.1075901399999999,3.33]
["o Tau","","*i*","","",81.908683600000003,"5 27 38",21.93696495,"+21 56 13.07",4.7290000000000001,4.8650000000000002,"B2.5IV         ","B2","IV        ",81.908683600000003,21.93696495,6.1349999999999998]
["HD 35633","","*i*","","",81.930345889999998,"5 27 43.2",34.532409880000003,"+34 31 56.67",8.32,8.09,"B0.5IV         ","B0","IV        ",81.930345889999998,34.532409880000003,2.91]
["HD 35653","","*iA","","",81.941338790000003,"5 27 45.9",33.945949480000003,"+33 56 45.41",7.5529999999999999,7.4969999999999999,"B0.5V          ","B0","V         ",81.941338790000003,33.945949480000003,3.5030000000000001]
["IU Aur","Var","bL*","","",81.968335589999995,"5 27 52.4",34.782847199999999,"+34 46 58.24",8.57,8.39,"B3Vnne         ","B3","Vnne      ",81.968335589999995,34.782847199999999,2.6099999999999994]
["HD 35881","","*  ",null,"",81.975970410000002,"5 27 54.2",1.10505108,"+1 6 18.18",7.69,7.77,"B8V            ","B8","V         ",81.975970410000002,1.10505108,3.2300000000000004]
["HR 1820","","*  ","","",82.006125920000002,"5 28 1.4",1.2982498,"+1 17 53.69",6.2149999999999999,6.3819999999999997,"B2V            ","B2","V         ",82.006125920000002,1.2982498,4.6180000000000003]
["HD 35910","","*  ",null,"",82.028835400000006,"5 28 6.9",3.5357382999999998,"+3 32 8.65",7.4660000000000002,7.57,"B6V            ","B6","V         ",82.028835400000006,3.5357382999999998,3.4299999999999997]
["BD+34 1056","","*iA","","",82.034880000000001,"5 28 8.3",34.395890000000001,"+34 23 45.2",10.06,9.8699999999999992,"B0.5V          ","B0","V         ",82.034880000000001,34.395890000000001,1.1300000000000008]
["HD 35926","","*  ",null,"",82.042159139999995,"5 28 10.1",0.78722157999999998,"+0 47 13.99",8.27,8.36,"B7IV           ","B7","IV        ",82.042159139999995,0.78722157999999998,2.6400000000000006]
["BD+34 1059","","*iA","","",82.177281199999996,"5 28 42.5",35.0137225,"+35 0 49.4",9.3699999999999992,9.26,"B0IV-V         ","B0","IV-V      ",82.177281199999996,35.0137225,1.7400000000000002]
["HD 36013","","*i*",null,"",82.188689949999997,"5 28 45.2",1.64393521,"+1 38 38.16",6.7409999999999997,6.891,"B3V:n          ","B3","V:n       ",82.188689949999997,1.64393521,4.109]
["HD 36012","","Be*",null,"Be",82.201902520000004,"5 28 48.4",2.1647131000000002,"+2 9 52.96",7.14,7.24,"B5Vne           ","B5","Vne       ",82.201902520000004,2.1647131000000002,3.76]
["HD 36012","","Be*",null,"Be",82.201902520000004,"5 28 48.4",2.1647131000000002,"+2 9 52.96",7.14,7.24,"B5Vne           ","B5","Vne       ",82.201902520000004,2.1647131000000002,3.76]
["118 Tau","","*i*",null,"",82.318750339999994,"5 29 16.5",25.15021613,"+25 9 0.77",5.44,5.48,"B9Vn           ","B9","Vn        ",82.318750339999994,25.15021613,5.52]
["HD 36133","","*i*",null,"",82.389702900000003,"5 29 33.5",3.1479167000000001,"+3 8 52.5",6.9710000000000001,7.0960000000000001,"B5V             ","B5","V         ",82.389702900000003,3.1479167000000001,3.9039999999999999]
["HD 36133","","*i*",null,"",82.389702900000003,"5 29 33.5",3.1479167000000001,"+3 8 52.5",6.9710000000000001,7.0960000000000001,"B5V             ","B5","V         ",82.389702900000003,3.1479167000000001,3.9039999999999999]
["LY Aur","Var","bL*","","",82.427708429999996,"5 29 42.6",35.3750249,"+35 22 30.08",6.96,6.85,"O9.5III:n        ","O9","III:n     ",82.427708429999996,35.3750249,4.1500000000000004]
["HR 1833","","V* ","","",82.478224659999995,"5 29 54.7",1.78925775,"+1 47 21.32",5.5609999999999999,5.742,"B2V            ","B2","V         ",82.478224659999995,1.78925775,5.258]
["HD 36165","","*  ",null,"",82.481478150000001,"5 29 55.5",2.14216674,"+2 8 31.8",8.0299999999999994,8.14,"B7V            ","B7","V         ",82.481478150000001,2.14216674,2.8599999999999994]
["HD 35952","","*iC",null,"",82.490019200000006,"5 29 57.6",35.954746900000004,"+35 57 17.08",9.07,8.84,"B5II-III        ","B5","II-III    ",82.490019200000006,35.954746900000004,2.16]
["HD 35952","","*iC",null,"",82.490019200000006,"5 29 57.6",35.954746900000004,"+35 57 17.08",9.07,8.84,"B5II-III        ","B5","II-III    ",82.490019200000006,35.954746900000004,2.16]
["CCDM J05308+0557AB","","** ",null,"",82.69604545,"5 30 47",5.9481367900000004,"+5 56 53.29",4.07,4.2,"B5V             ","B5","V         ",82.69604545,5.9481367900000004,6.8]
["CCDM J05308+0557AB","","** ",null,"",82.69604545,"5 30 47",5.9481367900000004,"+5 56 53.29",4.07,4.2,"B5V             ","B5","V         ",82.69604545,5.9481367900000004,6.8]
["HD 36312","","*  ",null,"",82.702805440000006,"5 30 48.6",2.8532060000000001E-2,"+0 1 42.71",8.06,8.1,"B8V            ","B8","V         ",82.702805440000006,2.8532060000000001E-2,2.9000000000000004]
["CCDM J05309+1015AB","","** ",null,"",82.715691629999995,"5 30 51.7",10.254381410000001,"+10 15 15.77",7.43,7.5,"B9V            ","B9","V         ",82.715691629999995,10.254381410000001,3.5]
["HD 36310","","*  ",null,"",82.740608739999999,"5 30 57.7",4.6687290199999998,"+4 40 7.42",7.93,7.95,"B6V            ","B6","V         ",82.740608739999999,4.6687290199999998,3.05]
["HD 36262","","*  ",null,"",82.756544739999995,"5 31 1.5",12.096765400000001,"+12 5 48.35",7.52,7.63,"B3V            ","B3","V         ",82.756544739999995,12.096765400000001,3.37]
["HD 36340","","*  ","","",82.770905150000004,"5 31 5",3.3532688099999999,"+3 21 11.76",7.82,7.95,"B2V            ","B2","V         ",82.770905150000004,3.3532688099999999,3.05]
["HD 244328","","*  ",null,"",82.806574600000005,"5 31 13.5",30.1775433,"+30 10 39.15",10.23,9.84,"B9V            ","B9","V         ",82.806574600000005,30.1775433,1.1600000000000001]
["CCDM J05313+0318AB","","** ","","",82.810549289999997,"5 31 14.5",3.29213136,"+3 17 31.67",5.29,5.46,"B1.5V          ","B1","V         ",82.810549289999997,3.29213136,5.54]
["HD 36392","","*  ","","",82.874525910000003,"5 31 29.8",1.6900364299999999,"+1 41 24.13",7.42,7.56,"B3V            ","B3","V         ",82.874525910000003,1.6900364299999999,3.4400000000000004]
["HD 36429","","*i*",null,"",82.921770710000004,"5 31 41.2",2.8328266900000001,"+2 49 58.17",7.43,7.56,"B5V             ","B5","V         ",82.921770710000004,2.8328266900000001,3.4400000000000004]
["HD 36429","","*i*",null,"",82.921770710000004,"5 31 41.2",2.8328266900000001,"+2 49 58.17",7.43,7.56,"B5V             ","B5","V         ",82.921770710000004,2.8328266900000001,3.4400000000000004]
["HD 36471","","*iN",null,"",83.030851580000004,"5 32 7.4",6.0470215999999999,"+6 2 49.27",8.7799999999999994,8.6999999999999993,"B8V            ",{"$f":"+LEFT(L960,2)","v":"B8"},{"$f":"+IF(MID(L960,3,1)=\".\",MID(L960,5,10),MID(L960,3,10))","v":"V         "},83.030851580000004,6.0470215999999999,2.3000000000000007]
["HD 36280","","*iA","","",83.047070930000004,"5 32 11.2",34.940146839999997,"+34 56 24.52",8.92,8.86,"B0.5IVn        ","B0","IVn       ",83.047070930000004,34.940146839999997,2.1400000000000006]
["BD+16 794B","","*i*",null,"",83.060654,"5 32 14.5",17.056063999999999,"+17 3 21.83",6.5270000000000001,6.49,"B7IV           ","B7","IV        ",83.060654,17.056063999999999,{"$f":"11-K962","v":4.51}]
["HD 36549","","*  ",null,"",83.164519049999996,"5 32 39.4",2.0921712700000001,"+2 5 31.81",8.5,8.5399999999999991,"B6Vwp...       ","B6","Vwp...    ",{"$f":"+F963","v":83.164519049999996},{"$f":"+H963","v":2.0921712700000001},2.4600000000000009]
["HD 36441","","*  ","","",83.194293290000005,"5 32 46.6",26.747416439999999,"+26 44 50.69",8.2899999999999991,8.23,"B1.5IV-Vn...   ","B1","IV-Vn...  ",83.194293290000005,26.747416439999999,2.7699999999999996]
["HD 36627","","*  ",null,"",83.287116249999997,"5 33 8.9",3.13109116,"+3 7 51.92",7.45,7.56,"B6V            ","B6","V         ",83.287116249999997,3.13109116,3.4400000000000004]
["HD 36645","","*  ",null,"",83.341127850000007,"5 33 21.8",2.3765667700000002,"+2 22 35.64",8.6300000000000008,8.65,"B9V            ","B9","V         ",83.341127850000007,2.3765667700000002,2.3499999999999996]
["V1107 Ori","Var","Ro*",null,"",83.358578750000007,"5 33 26",0.62136705000000003,"+0 37 16.92",7.94,8.0500000000000007,"B6Vwp...       ","B6","Vwp...    ",83.358578750000007,0.62136705000000003,2.9499999999999993]
["HR 1846","","*  ",null,"",83.369684640000003,"5 33 28.7",42.108958880000003,"+42 6 32.25",6.53,6.54,"B9IIIp...      ","B9","IIIp...   ",83.369684640000003,42.108958880000003,4.46]
["120 Tau","","Be*","","Be",83.381798180000004,"5 33 31.6",18.54023076,"+18 32 24.83",5.6420000000000003,5.6669999999999998,"B2IV-Ve        ","B2","IV-Ve     ",83.381798180000004,18.54023076,5.3330000000000002]
["HD 36547                 ",{"$f":"IF(LEFT(A970,2)=\"V*\",\"var\",\"\")","v":""},"*  ","","",83.390016700000004,"5 33 33.6",23.342265000000001," 23 20 32.15",9.09,8.81,"B1III          ","B1","III       ",83.390016700000004,23.342265000000001,2.1899999999999995]
["HR 1860","","V* ",null,"",83.411826129999994,"5 33 38.8",20.474217549999999,"+20 28 27.18",6.1539999999999999,6.1879999999999997,"B6V            ","B6","V         ",83.411826129999994,20.474217549999999,4.8120000000000003]
["35 Ori","","*  ",null,"",83.476186060000003,"5 33 54.2",14.30557898,"+14 18 20.08",5.4720000000000004,5.5880000000000001,"B3V            ","B3","V         ",83.476186060000003,14.30557898,5.4119999999999999]
["HR 1871","","*  ","","",83.489944769999994,"5 33 57.5",1.4076452100000001,"+1 24 27.52",6.3879999999999999,6.5659999999999998,"B2V            ","B2","V         ",83.489944769999994,1.4076452100000001,4.4340000000000002]
["HD 244765","","*  ",null,"",83.522804600000001,"5 34 5.4",33.968283900000003,"+33 58 5.82",9.93,9.69,"B9m            ","B9","m         ",83.522804600000001,33.968283900000003,1.3100000000000005]
["HD 36824","","*  ","","",83.680659410000004,"5 34 43.3",5.6608816800000001,"+5 39 39.17",6.5590000000000002,6.7130000000000001,"B3V            ","B3","V         ",83.680659410000004,5.6608816800000001,4.2869999999999999]
["Lambda Ori X-5","","*  ","","",83.705158490000002,"5 34 49.2",9.4895799499999995,"+9 29 22.48",4.2350000000000003,4.3979999999999997,"B0III          ","B0","III       ",83.705158490000002,9.4895799499999995,6.6020000000000003]
["HR 1880","","*i*","","",83.784999999999997,"5 35 8.3",9.9350000000000005,"+9 56 6",5.65,5.61,"B0.5V          ","B0","V         ",83.784999999999997,9.9350000000000005,5.39]
["HD 36895","","*  ","","",83.803316710000004,"5 35 12.7",9.6132626999999999,"+9 36 47.74",6.61,6.73,"B2IV-V         ","B2","IV-V      ",83.803316710000004,9.6132626999999999,4.2699999999999996]
["HR 1883","","*  ",null,"",83.805164300000001,"5 35 13.2",10.240088979999999,"+10 14 24.32",5.7279999999999998,5.625,"B9IIImnp...    ","B9","IIImnp... ",83.805164300000001,10.240088979999999,5.375]
["HD 245203","","*  ",null,"",83.807535400000006,"5 35 13.8",9.6970761000000003,"+9 41 49.47",7.37,7.47,"B8V            ","B8","V         ",83.807535400000006,9.6970761000000003,3.5300000000000002]
["HD 36894","","*  ",null,"",83.8195762,"5 35 16.6",9.7776311000000007,"+9 46 39.47",7.48,7.62,"B9V            ","B9","V         ",83.8195762,9.7776311000000007,3.38]
["121 Tau","","*  ","","",83.863043630000007,"5 35 27.1",24.039590180000001,"+24 2 22.52",5.28,5.3710000000000004,"B2.5IV         ","B2","IV        ",83.863043630000007,24.039590180000001,5.6289999999999996]
["HD 37035","","*  ",null,"",83.992720090000006,"5 35 58.2",9.53171854,"+9 31 54.18",8.6300000000000008,8.65,"B9V            ","B9","V         ",83.992720090000006,9.53171854,2.3499999999999996]
["HD 37051","","*  ",null,"",84.017444600000005,"5 36 4.1",9.8319410999999999,"+9 49 54.98",9.17,9.1999999999999993,"B9V            ","B9","V         ",84.017444600000005,9.8319410999999999,1.8000000000000007]
["BD+34 1100","","*iC","","",84.0391683,"5 36 9.4",34.282036099999999,"+34 16 55.32",9.65,9.6,"B2V            ","B2","V         ",84.0391683,34.282036099999999,1.4000000000000004]
["BD+26 870A","","*i*",null,"",84.286829999999995,"5 37 8.8",26.924530000000001,"+26 55 28.3",6.4,6.4,"B8IV           ","B8","IV        ",84.286829999999995,26.924530000000001,4.5999999999999996]
["CCDM J05371+2656AB","","** ","","",84.286860809999993,"5 37 8.8",26.924472399999999,"+26 55 28.1",5.76,5.83,"B9IV-V         ","B9","IV-V      ",84.286860809999993,26.924472399999999,5.17]
["HD 37032","","*  ","","",84.287468410000002,"5 37 8.9",34.811955490000003,"+34 48 43.03",8.18,8.15,"B0.5V          ","B0","V         ",84.287468410000002,34.811955490000003,2.8499999999999996]
["HR 1913","","*  ","","",84.330459289999993,"5 37 19.3",8.9518719699999991,"+8 57 6.73",5.9390000000000001,6.1050000000000004,"B2IV-V         ","B2","IV-V      ",84.330459289999993,8.9518719699999991,4.8949999999999996]
["BD+44 1251","","*  ",null,"",84.355173800000003,"5 37 25.2",44.845483899999998,"+44 50 43.74",9.69,9.64,"B9V            ","B9","V         ",84.355173800000003,44.845483899999998,1.3599999999999994]
["HD 245546","","Be*",null,"Be",84.409151069999993,"5 37 38.1",23.14745589,"+23 8 50.84",8.98,8.9600000000000009,"B5ne            ","B5","ne        ",84.409151069999993,23.14745589,2.0399999999999991]
["HD 245546","","Be*",null,"Be",84.409151069999993,"5 37 38.1",23.14745589,"+23 8 50.84",8.98,8.9600000000000009,"B5ne            ","B5","ne        ",84.409151069999993,23.14745589,2.0399999999999991]
["zet Tau","","Be*","","Be",84.41118926,"5 37 38.6",21.142544109999999,"+21 8 33.15",2.84,3.03,"B2IVp          ","B2","IVp       ",84.41118926,21.142544109999999,7.9700000000000006]
["HD 37330","","Be*",null,"Be",84.472723149999993,"5 37 53.4",0.96860738000000002,"+0 58 6.98",7.31,7.38,"B6V            ","B6","V         ",84.472723149999993,0.96860738000000002,3.62]
["HD 37342","","*i*",null,"",84.484380259999995,"5 37 56.2",0.98741838999999998,"+0 59 14.7",7.89,8.01,"B5V             ","B5","V         ",84.484380259999995,0.98741838999999998,2.99]
["HD 37342","","*i*",null,"",84.484380259999995,"5 37 56.2",0.98741838999999998,"+0 59 14.7",7.89,8.01,"B5V             ","B5","V         ",84.484380259999995,0.98741838999999998,2.99]
["HR 1920","","*  ",null,"",84.504661110000001,"5 38 1.1",7.5414168699999999,"+7 32 29.1",5.7969999999999997,5.8579999999999997,"B8III          ","B8","III       ",84.504661110000001,7.5414168699999999,5.1420000000000003]
["BD+44 1254","","*  ",null,"",84.549291699999998,"5 38 11.8",44.7001147,"+44 42 0.41",9.4600000000000009,9.4,"B9V            ","B9","V         ",84.549291699999998,44.7001147,1.5999999999999996]
["HD 245731","","*  ",null,"",84.690664200000001,"5 38 45.7",26.7601531,"+26 45 36.55",9.48,9.48,"B3V            ","B3","V         ",84.690664200000001,26.7601531,1.5199999999999996]
["BD+44 1258","","*  ",null,"",84.692040399999996,"5 38 46",44.577547799999998,"+44 34 39.17",9.94,9.77,"B9V            ","B9","V         ",84.692040399999996,44.577547799999998,1.2300000000000004]
["HD 37467","","*  ",null,"",84.71930279,"5 38 52.6",2.8617732600000001,"+2 51 42.38",7.8,7.88,"B7IV-V         ","B7","IV-V      ",84.71930279,2.8617732600000001,3.12]
["HD 37318                 ",{"$f":"IF(LEFT(A1002,2)=\"V*\",\"var\",\"\")","v":""},"Be*","","Be",84.741729129999996,"5 38 58",28.460135340000001," 28 27 36.48",8.66,8.41,"B1Vne          ","B1","Vne       ",84.741729129999996,28.460135340000001,2.59]
["BD+44 1259","","*  ",null,"",84.766599999999997,"5 39 3.9",44.8829511,"+44 52 58.62",10.119999999999999,9.99,"B9V            ","B9","V         ",84.766599999999997,44.8829511,1.0099999999999998]
["ome Ori","","Be*","","Be",84.796442990000003,"5 39 11.1",4.1214665200000002,"+4 7 17.27",4.46,4.57,"B3IIIe         ","B3","IIIe      ",84.796442990000003,4.1214665200000002,6.43]
["V433 Aur","Var","LP*","","",84.826301810000004,"5 39 18.3",29.215213120000001,"+29 12 54.76",6.117,5.9889999999999999,"B2IV-V         ","B2","IV-V      ",84.826301810000004,29.215213120000001,5.0110000000000001]
["HD 37366","","*  ","","",84.853341599999993,"5 39 24.8",30.890769859999999,"+30 53 26.77",7.71,7.64,"O9.5V            ","O9","V         ",84.853341599999993,30.890769859999999,3.3600000000000003]
["125 Tau","","*  ","","",84.934166059999995,"5 39 44.1",25.897091540000002,"+25 53 49.52",5.0229999999999997,5.1619999999999999,"B3IV           ","B3","IV        ",84.934166059999995,25.897091540000002,5.8380000000000001]
["HD 37606","","*  ",null,"",84.954521639999996,"5 39 49",1.49172584,"+1 29 30.21",6.8239999999999998,6.89,"B8V            ","B8","V         ",84.954521639999996,1.49172584,4.1100000000000003]
["HD 37383","","*  ",null,"",85.085904200000002,"5 40 20.6",43.730722800000002,"+43 43 50.6",9.0399999999999991,8.91,"B3V            ","B3","V         ",85.085904200000002,43.730722800000002,2.09]
["HD 246079","","*  ",null,"",85.110183300000003,"5 40 26.4",26.0247475,"+26 1 29.09",9.94,9.89,"B5V             ","B5","V         ",85.110183300000003,26.0247475,1.1099999999999994]
["HD 246079","","*  ",null,"",85.110183300000003,"5 40 26.4",26.0247475,"+26 1 29.09",9.94,9.89,"B5V             ","B5","V         ",85.110183300000003,26.0247475,1.1099999999999994]
["126 Tau","","*  ","","",85.323823649999994,"5 41 17.7",16.53414592,"+16 32 2.92",4.7110000000000003,4.8319999999999999,"B3IV           ","B3","IV        ",85.323823649999994,16.53414592,6.1680000000000001]
["BD+16 841A","","*i*",null,"",85.323830000000001,"5 41 17.7",16.534189999999999,"+16 32 3.08",4.7,4.9000000000000004,"B3V            ","B3","V         ",85.323830000000001,16.534189999999999,6.1]
["HR 1945","","*i*",null,"",85.337404460000002,"5 41 20.9",29.487415510000002,"+29 29 14.69",6.2949999999999999,6.3739999999999997,"B8IV           ","B8","IV        ",85.337404460000002,29.487415510000002,4.6260000000000003]
["HD 37614","","*  ","","",85.379556120000004,"5 41 31",38.188318170000002,"+38 11 17.94",8.2799999999999994,8.23,"B2III          ","B2","III       ",85.379556120000004,38.188318170000002,2.7699999999999996]
["HR 1951","","*  ",null,"",85.478172560000004,"5 41 54.7",23.326228789999998,"+23 19 34.42",6.5010000000000003,6.5759999999999996,"B8p            ","B8","p         ",85.478172560000004,23.326228789999998,4.4240000000000004]
["BD+45 1160","","*  ",null,"",85.531516300000007,"5 42 7.5",46.061362799999998,"+46 3 40.9",10.029999999999999,9.89,"B8V            ","B8","V         ",85.531516300000007,46.061362799999998,1.1099999999999994]
["HD 37657","","Be*",null,"Be",85.582771679999993,"5 42 19.8",43.059591789999999,"+43 3 34.53",7.25,7.25,"B3Vne          ","B3","Vne       ",85.582771679999993,43.059591789999999,3.75]
["HD 37737","","*  ","","",85.62982993,"5 42 31.1",36.20014183,"+36 12 0.51",8.3000000000000007,8.06,"O9.5III(n)       ","O9","III(n)    ",85.62982993,36.20014183,2.9399999999999995]
["HD 37767","","*  ","","",85.672823879999996,"5 42 41.4",36.149841039999998,"+36 8 59.42",9.0299999999999994,8.93,"B3V            ","B3","V         ",85.672823879999996,36.149841039999998,2.0700000000000003]
["BD+37 1292","","Be*","","Be",85.709925799999994,"5 42 50.3",37.984098899999999,"+37 59 2.75",9.32,9.23,"B3V:pe...      ","B3","V:pe...   ",85.709925799999994,37.984098899999999,1.7699999999999996]
["BD+34 1150","","Em*","Em","",85.7765871,"5 43 6.3",34.348634400000002,"+34 20 55.08",9.67,9.5299999999999994,"B2V            ","B2","V         ",85.7765871,34.348634400000002,1.4700000000000006]
["HR 1961","","Be*","","Be",85.831257359999995,"5 43 19.5",23.204373220000001,"+23 12 15.74",6.157,6.2270000000000003,"B2.5Ve         ","B2","Ve        ",85.831257359999995,23.204373220000001,4.7729999999999997]
["V* V1165 Tau             ",{"$f":"IF(LEFT(A1024,2)=\"V*\",\"var\",\"\")","v":"var"},"bC*","","",85.91274722,"5 43 39",25.43954428," 25 26 22.35",6.83,6.82,"B1Vpe          ",{"$f":"+LEFT(L1024,2)","v":"B1"},{"$f":"+IF(MID(L1024,3,1)=\".\",MID(L1024,5,10),MID(L1024,3,10))","v":"Vpe       "},85.91274722,25.43954428,4.18]
["BD+46 1043","","*  ","","",86.0773358,"5 44 18.5",46.276995800000002,"+46 16 37.18",9.64,9.4,"B3V            ","B3","V         ",86.0773358,46.276995800000002,1.5999999999999996]
["HD 246878","","** ","","",86.115516700000001,"5 44 27.7",27.229905429999999,"+27 13 47.65",9.4499999999999993,9.3699999999999992,"B0.5V:pe       ","B0","V:pe      ",86.115516700000001,27.229905429999999,{"$f":"11-K1026","v":1.6300000000000008}]
["HD 38131","","*  ","","",86.272852499999999,"5 45 5.4",35.163176900000003,"+35 9 47.43",8.35,8.1999999999999993,"B0.5V          ","B0","V         ",{"$f":"+F1027","v":86.272852499999999},{"$f":"+H1027","v":35.163176900000003},2.8000000000000007]
["HD 38060","","*  ",null,"",86.299892499999999,"5 45 11.9",44.734775599999999,"+44 44 5.19",9.66,9.3699999999999992,"B9V            ","B9","V         ",86.299892499999999,44.734775599999999,1.6300000000000008]
["BD+34 1162","","*  ","","",86.301172500000007,"5 45 12.2",34.095996100000001,"+34 5 45.58",9.0399999999999991,8.9499999999999993,"B2V:nn         ","B2","V:nn      ",86.301172500000007,34.095996100000001,2.0500000000000007]
["HD 247176","","*  ","","",86.435434999999998,"5 45 44.5",26.560265000000001,"+26 33 36.95",9.75,9.61,"B2V            ","B2","V         ",86.435434999999998,26.560265000000001,1.3900000000000006]
["HD 38188","","*  ",null,"",86.547982469999994,"5 46 11.5",44.783240790000001,"+44 46 59.66",8.09,7.98,"B5V             ","B5","V         ",86.547982469999994,44.783240790000001,3.0199999999999996]
["HD 38188","","*  ",null,"",86.547982469999994,"5 46 11.5",44.783240790000001,"+44 46 59.66",8.09,7.98,"B5V             ","B5","V         ",86.547982469999994,44.783240790000001,3.0199999999999996]
["HD 247209","","*  ",null,"",86.550513300000006,"5 46 12.1",31.387785600000001,"+31 23 16.02",9.4,9.4,"B8m            ","B8","m         ",86.550513300000006,31.387785600000001,1.5999999999999996]
["BD+45 1169","","*  ","","",86.653081700000001,"5 46 36.7",45.271583100000001,"+45 16 17.69",10.15,9.9700000000000006,"B3V            ","B3","V         ",86.653081700000001,45.271583100000001,1.0299999999999994]
["129 Tau","","*  ",null,"",86.689565779999995,"5 46 45.4",15.822498680000001,"+15 49 20.99",5.9210000000000003,5.9909999999999997,"B8IIImnp...    ","B8","IIImnp... ",86.689565779999995,15.822498680000001,5.0090000000000003]
["BD+43 1349","","*  ",null,"",86.738619200000002,"5 46 57.2",43.537240799999999,"+43 32 14.06",9.23,9.0399999999999991,"B3III          ","B3","III       ",86.738619200000002,43.537240799999999,1.9600000000000009]
["133 Tau","","V* ","","",86.928782699999999,"5 47 42.9",13.89959998,"+13 53 58.55",5.1159999999999997,5.2679999999999998,"B2IV-V         ","B2","IV-V      ",86.928782699999999,13.89959998,5.7320000000000002]
["HR 1997","","*  ",null,"",87.093198349999994,"5 48 22.3",20.86948061,"+20 52 10.13",5.9669999999999996,6.0179999999999998,"B9Vn           ","B9","Vn        ",87.093198349999994,20.86948061,4.9820000000000002]
["IY Aur","Var","bL*",null,"",87.113327900000002,"5 48 27.1",43.082645800000002,"+43 4 57.52",9.58,9.39,"B5p...          ","B5","p...      ",87.113327900000002,43.082645800000002,1.6099999999999994]
["IY Aur","Var","bL*",null,"",87.113327900000002,"5 48 27.1",43.082645800000002,"+43 4 57.52",9.58,9.39,"B5p...          ","B5","p...      ",87.113327900000002,43.082645800000002,1.6099999999999994]
["HD 247754                ",{"$f":"IF(LEFT(A1041,2)=\"V*\",\"var\",\"\")","v":""},"*  ","","",87.119335000000007,"5 48 28.6",25.113485799999999," 25 6 48.54",9.8800000000000008,9.7200000000000006,"B1V:nn         ","B1","V:nn      ",87.119335000000007,25.113485799999999,1.2799999999999994]
["BD+36 1261","","*  ","","",87.123539600000001,"5 48 29.6",36.211491700000003,"+36 12 41.37",9.31,9.1199999999999992,"B2III:p...     ","B2","III:p...  ",87.123539600000001,36.211491700000003,1.8800000000000008]
["HD 38708","","Be*","","Be",87.223539160000001,"5 48 53.6",29.1361159,"+29 8 10.01",8.02,8.0500000000000007,"B3pshe         ","B3","pshe      ",87.223539160000001,29.1361159,2.9499999999999993]
["134 Tau","","*i*","","",87.387207259999997,"5 49 32.9",12.651321729999999,"+12 39 4.75",4.8209999999999997,4.8769999999999998,"B9IV           ","B9","IV        ",87.387207259999997,12.651321729999999,6.1230000000000002]
["HD 39033","","*  ",null,"",87.493478499999995,"5 49 58.4",0.15329877,"+0 9 11.87",8.08,7.88,"B9V            ","B9","V         ",87.493478499999995,0.15329877,3.12]
["HD 38909","","*  ","","",87.620259059999995,"5 50 28.8",31.06520274,"+31 3 54.72",8.14,8.14,"B3II-III       ","B3","II-III    ",87.620259059999995,31.06520274,2.8599999999999994]
["HD 38850","","*  ",null,"",87.686731899999998,"5 50 44.8",43.689373699999997,"+43 41 21.74",8.48,8.41,"B9V            ","B9","V         ",87.686731899999998,43.689373699999997,2.59]
["HD 39096","","*  ",null,"",87.887410979999999,"5 51 32.9",28.092145909999999,"+28 5 31.72",8.17,8.14,"B8III          ","B8","III       ",87.887410979999999,28.092145909999999,2.8599999999999994]
["HD 39136","","*  ",null,"",87.978231699999995,"5 51 54.7",32.239749400000001,"+32 14 23.09",8.8800000000000008,8.77,"B3III          ","B3","III       ",87.978231699999995,32.239749400000001,2.2300000000000004]
["V809 Tau","Var","a2*",null,"",88.092881500000004,"5 52 22.2",14.171786490000001,"+14 10 18.43",5.5490000000000004,5.5949999999999998,"B9spe...       ","B9","spe...    ",88.092881500000004,14.171786490000001,5.4050000000000002]
["HD 39285","","*  ",null,"",88.097079260000001,"5 52 23.2",20.696389979999999,"+20 41 47",8.2200000000000006,8.2100000000000009,"B9V            ","B9","V         ",88.097079260000001,20.696389979999999,2.7899999999999991]
["HR 2030","","*  ",null,"",88.097528580000002,"5 52 23.4",19.86784819,"+19 52 4.25",6.4989999999999997,6.0010000000000003,"B8III+...      ","B8","III+...   ",88.097528580000002,19.86784819,4.9989999999999997]
["HD 39304","","*  ",null,"",88.244327630000001,"5 52 58.6",28.460858609999999,"+28 27 39.09",9.2200000000000006,9.2200000000000006,"B8III          ","B8","III       ",88.244327630000001,28.460858609999999,1.7799999999999994]
["HD 39340","","Be*","","Be",88.275393949999994,"5 53 6",26.44540563,"+26 26 43.46",8.17,8.1300000000000008,"B3V            ","B3","V         ",88.275393949999994,26.44540563,2.8699999999999992]
["HR 2038","","*  ",null,"",88.329261049999999,"5 53 19",20.299105099999998,"+20 17 56.77",6.6429999999999998,6.6909999999999998,"B9V            ","B9","V         ",88.329261049999999,20.299105099999998,4.3090000000000002]
["HD 39557","","Be*",null,"Be",88.363082000000006,"5 53 27.1",0.77921143000000004,"+0 46 45.16",9.48,9.07,"B5III           ","B5","III       ",88.363082000000006,0.77921143000000004,1.9299999999999997]
["HD 39557","","Be*",null,"Be",88.363082000000006,"5 53 27.1",0.77921143000000004,"+0 46 45.16",9.48,9.07,"B5III           ","B5","III       ",88.363082000000006,0.77921143000000004,1.9299999999999997]
["HD 248753                ",{"$f":"IF(LEFT(A1058,2)=\"V*\",\"var\",\"\")","v":""},"Be*","","Be",88.379592549999998,"5 53 31.1",25.742242640000001," 25 44 32.07",8.58,8.48,"B1Vnne         ","B1","Vnne      ",88.379592549999998,25.742242640000001,2.5199999999999996]
["HD 39451","","*  ",null,"",88.472454600000006,"5 53 53.3",28.9565822,"+28 57 23.69",8.93,8.85,"B8V            ","B8","V         ",88.472454600000006,28.9565822,2.1500000000000004]
["HD 39478","","Be*","","Be",88.499369880000003,"5 53 59.8",26.422529220000001,"+26 25 21.1",8.31,8.25,"B2V            ","B2","V         ",88.499369880000003,26.422529220000001,2.75]
["HD 248893","","*  ","","",88.507408799999993,"5 54 1.7",22.108166099999998,"+22 6 29.39",10,9.75,"B0II-III       ","B0","II-III    ",88.507408799999993,22.108166099999998,1.25]
["HD 248924","","*  ",null,"",88.578233650000001,"5 54 18.7",24.328669810000001,"+24 19 43.21",9.8800000000000008,9.73,"B8III:         ","B8","III:      ",88.578233650000001,24.328669810000001,1.2699999999999996]
["HD 39773","","*i*",null,"",88.731042979999998,"5 54 55.4",5.8607738700000001,"+5 51 38.78",6.8470000000000004,6.8819999999999997,"B9V            ","B9","V         ",88.731042979999998,5.8607738700000001,4.1180000000000003]
["57 Ori","","*  ","","",88.736197809999993,"5 54 56.6",19.749612719999998,"+19 44 58.6",5.758,5.9009999999999998,"B2V            ","B2","V         ",88.736197809999993,19.749612719999998,5.0990000000000002]
["HD 39611","","*  ",null,"",88.740786700000001,"5 54 57.7",28.388584699999999,"+28 23 18.9",8.76,8.67,"B8III          ","B8","III       ",88.740786700000001,28.388584699999999,2.33]
["HD 249072","","*  ",null,"",88.828088300000005,"5 55 18.7",27.1138619,"+27 6 49.9",9.51,9.4,"B8III          ","B8","III       ",88.828088300000005,27.1138619,1.5999999999999996]
["HD 249071","","*  ","","",88.831642500000001,"5 55 19.5",27.9149244,"+27 54 53.72",9.7899999999999991,9.4499999999999993,"B2III:         ","B2","III:      ",88.831642500000001,27.9149244,1.5500000000000007]
["HD 249105","","*  ",null,"",88.856082099999995,"5 55 25.4",26.1769219,"+26 10 36.91",9.6199999999999992,9.43,"B7V            ","B7","V         ",88.856082099999995,26.1769219,1.5700000000000003]
["HD 39712","","*  ","","",88.9026882,"5 55 36.6",30.71138015,"+30 42 40.96",8.4600000000000009,8.4,"B2IV           ","B2","IV        ",88.9026882,30.71138015,2.5999999999999996]
["Z Ori","Var","Al*",null,"",88.962215189999995,"5 55 50.9",13.694989209999999,"+13 41 41.96",10.01,9.98,"B4V...         ","B4","V...      ",88.962215189999995,13.694989209999999,1.0199999999999996]
["HD 249155","","*  ",null,"",88.971654000000001,"5 55 53.1",27.975833000000002,"+27 58 32.99",9.76,9.48,"B8III          ","B8","III       ",88.971654000000001,27.975833000000002,1.5199999999999996]
["V1384 Ori","Var","Al*","","",89.210807689999996,"5 56 50.5",16.35507445,"+16 21 18.26",7.1,7.23,"B2V            ","B2","V         ",89.210807689999996,16.35507445,3.7699999999999996]
["HD 249788                ",{"$f":"IF(LEFT(A1073,2)=\"V*\",\"var\",\"\")","v":""},"*  ","","",89.695099600000006,"5 58 46.8",23.250786399999999," 23 15 2.83",9.4499999999999993,9.16,"B1V            ","B1","V         ",89.695099600000006,23.250786399999999,1.8399999999999999]
["HD 250310","","*i*","","",90.262234199999995,"6 1 2.9",20.234746699999999,"+20 14 5.08",9.26,9.11,"B3V            ","B3","V         ",90.262234199999995,20.234746699999999,1.8900000000000006]
["HD 40681","","*  ",null,"",90.273405550000007,"6 1 5.6",16.991449800000002,"+16 59 29.21",7.67,7.66,"B9V            ","B9","V         ",90.273405550000007,16.991449800000002,3.34]
["HD 250289","","Be*","","Be",90.274457949999999,"6 1 5.8",23.338996640000001,"+23 20 20.38",8.7100000000000009,8.23,"B2III:e        ","B2","III:e     ",90.274457949999999,23.338996640000001,2.7699999999999996]
["HD 288372","","*  ",null,"",90.351112900000004,"6 1 24.2",1.1563464000000001,"+1 9 22.84",9.8800000000000008,9.67,"B9V            ","B9","V         ",90.351112900000004,1.1563464000000001,1.33]
["RW Gem","Var","Al*",null,"",90.366923819999997,"6 1 28",23.14097538,"+23 8 27.51",9.89,9.7899999999999991,"B6V            ","B6","V         ",90.366923819999997,23.14097538,1.2100000000000009]
["HD 40677","","*  ",null,"",90.409588299999996,"6 1 38.3",28.2096594,"+28 12 34.77",9.06,8.99,"B9V            ","B9","V         ",90.409588299999996,28.2096594,2.0099999999999998]
["HR 2116","","*  ",null,"",90.423438869999998,"6 1 41.6",22.400998619999999,"+22 24 3.59",6.2969999999999997,6.3559999999999999,"B8V            ","B8","V         ",90.423438869999998,22.400998619999999,4.6440000000000001]
["HR 2127","","*  ",null,"",90.571275990000004,"6 2 17.1",1.6940526899999999,"+1 41 38.58",6.5259999999999998,6.5709999999999997,"B8V            ","B8","V         ",90.571275990000004,1.6940526899999999,4.4290000000000003]
["HD 40983","","*  ",null,"",90.593842289999998,"6 2 22.5",1.0892644600000001,"+1 5 21.35",8.56,8.5399999999999991,"B9V            ","B9","V         ",90.593842289999998,1.0892644600000001,2.4600000000000009]
["HD 40802","","*i*",null,"",90.596943800000005,"6 2 23.2",27.476778599999999,"+27 28 36.4",9.2799999999999994,9.1999999999999993,"B7V            ","B7","V         ",90.596943800000005,27.476778599999999,1.8000000000000007]
["HD 250541","","*  ",null,"",90.653057500000003,"6 2 36.7",27.905479700000001,"+27 54 19.72",9.4499999999999993,9.4,"B6III          ","B6","III       ",90.653057500000003,27.905479700000001,1.5999999999999996]
["HD 40894","","*  ","","",90.747440889999993,"6 2 59.3",28.677015019999999,"+28 40 37.25",7.48,7.56,"B2V            ","B2","V         ",90.747440889999993,28.677015019999999,3.4400000000000004]
["HD 40893","","*  ","","",90.776785000000004,"6 3 6.4",31.0522806,"+31 3 8.21",9.0500000000000007,8.99,"B0IV:          ","B0","IV:       ",90.776785000000004,31.0522806,2.0099999999999998]
["HD 250684","","*  ",null,"",90.781437100000005,"6 3 7.5",27.4404547,"+27 26 25.63",9.89,9.73,"B8V            ","B8","V         ",90.781437100000005,27.4404547,1.2699999999999996]
["64 Ori","","*  ",null,"",90.864025409999996,"6 3 27.3",19.6905617,"+19 41 26.02",5.0389999999999997,5.1349999999999998,"B8V            ",{"$f":"+LEFT(L1088,2)","v":"B8"},{"$f":"+IF(MID(L1088,3,1)=\".\",MID(L1088,5,10),MID(L1088,3,10))","v":"V         "},90.864025409999996,19.6905617,5.8650000000000002]
["HD 41055","","*  ",null,"",91.002190400000003,"6 4 0.5",28.646330800000001,"+28 38 46.79",8.8699999999999992,8.8000000000000007,"B7III          ","B7","III       ",91.002190400000003,28.646330800000001,2.1999999999999993]
["HD 41138","","*  ",null,"",91.097724999999997,"6 4 23.4",28.984556000000001,"+28 59 4.4",8.7200000000000006,8.67,"B7III          ","B7","III       ",91.097724999999997,28.984556000000001,{"$f":"11-K1090","v":2.33}]
["HD 40978","","Be*","","Be",91.160036210000001,"6 4 38.4",46.585111849999997,"+46 35 6.4",7.1920000000000002,7.29,"B3Ve           ","B3","Ve        ",{"$f":"+F1091","v":91.160036210000001},{"$f":"+H1091","v":46.585111849999997},3.71]
["HD 251128","","*  ",null,"",91.183520000000001,"6 4 44",21.424082500000001,"+21 25 26.69",9.89,9.81,"B5V             ","B5","V         ",91.183520000000001,21.424082500000001,1.1899999999999995]
["HD 251128","","*  ",null,"",91.183520000000001,"6 4 44",21.424082500000001,"+21 25 26.69",9.89,9.81,"B5V             ","B5","V         ",91.183520000000001,21.424082500000001,1.1899999999999995]
["HD 251117","","*  ","","",91.244405400000005,"6 4 58.6",28.7668781,"+28 46 0.76",9.26,9.14,"B0IV           ","B0","IV        ",91.244405400000005,28.7668781,1.8599999999999994]
["HD 41252","","*  ",null,"",91.252035800000002,"6 5 0.4",26.073844999999999,"+26 4 25.84",8.99,9.02,"B8III          ","B8","III       ",91.252035800000002,26.073844999999999,1.9800000000000004]
["HR 2139","","*  ",null,"",91.39124837,"6 5 33.8",33.599049559999997,"+33 35 56.57",6.1420000000000003,6.2160000000000002,"B9sp...        ","B9","sp...     ",91.39124837,33.599049559999997,4.7839999999999998]
["BD+20 1250","","*  ",null,"",91.462999999999994,"6 5 51.1",20.984999999999999,"+20 59 5.99",null,9.5,"B9V            ","B9","V         ",91.462999999999994,20.984999999999999,1.5]
["HD 41419","","*  ",null,"",91.5075267,"6 6 1.8",23.514328899999999,"+23 30 51.58",8.6,8.57,"B9V            ","B9","V         ",91.5075267,23.514328899999999,2.4299999999999997]
["HD 41418","","*  ",null,"",91.565107380000001,"6 6 15.6",27.9347046,"+27 56 4.93",8.7100000000000009,8.64,"B9V            ","B9","V         ",91.565107380000001,27.9347046,2.3599999999999994]
["HD 41455","","*  ",null,"",91.620437499999994,"6 6 28.9",27.055564520000001,"+27 3 20.03",8.64,8.65,"B8V            ","B8","V         ",91.620437499999994,27.055564520000001,2.3499999999999996]
["HD 251617","","*  ",null,"",91.69923,"6 6 47.8",25.553234199999999,"+25 33 11.64",9.9600000000000009,9.93,"B9V            ","B9","V         ",91.69923,25.553234199999999,1.0700000000000003]
["HD 251726                ",{"$f":"IF(LEFT(A1102,2)=\"V*\",\"var\",\"\")","v":""},"Be*","","Be",91.726524600000005,"6 6 54.3",19.034460800000002," 19 2 4.05",9.76,9.34,"B1V:e          ","B1","V:e       ",91.726524600000005,19.034460800000002,1.6600000000000001]
["HD 251847                ",{"$f":"IF(LEFT(A1103,2)=\"V*\",\"var\",\"\")","v":""},"*  ","","",91.891189199999999,"6 7 33.8",23.7390711," 23 44 20.65",9.02,9.01,"B1IV           ","B1","IV        ",91.891189199999999,23.7390711,1.9900000000000002]
["67 Ori","","*  ","","",91.893024479999994,"6 7 34.3",14.76847392,"+14 46 6.5",4.25,4.4029999999999996,"B3V            ","B3","V         ",91.893024479999994,14.76847392,6.5970000000000004]
["HD 41690                 ",{"$f":"IF(LEFT(A1105,2)=\"V*\",\"var\",\"\")","v":""},"*  ","","",91.912060299999993,"6 7 38.8",21.873176579999999," 21 52 23.43",7.89,7.75,"B1V            ","B1","V         ",91.912060299999993,21.873176579999999,3.25]
["V916 Ori","Var","bC*","","",92.07544704,"6 8 18.1",13.971529329999999,"+13 58 17.5",8.09,8.1,"B2.5V          ","B2","V         ",92.07544704,13.971529329999999,2.9000000000000004]
["HD 41831","","*  ","","",92.085934199999997,"6 8 20.6",22.2082528,"+22 12 29.71",9.27,9.1199999999999992,"B3V            ","B3","V         ",92.085934199999997,22.2082528,1.8800000000000008]
["V917 Ori","Var","bC*","","",92.113975409999995,"6 8 27.3",13.93086776,"+13 55 51.12",8.74,8.7899999999999991,"B3Vn           ","B3","Vn        ",92.113975409999995,13.93086776,2.2100000000000009]
["HD 252266","","*i*",null,"",92.125737999999998,"6 8 30.1",13.959031,"+13 57 32.51",9.0510000000000002,9.0039999999999996,"B3V            ","B3","V         ",92.125737999999998,13.959031,1.9960000000000004]
["BD+13 1124A              ",{"$f":"IF(LEFT(A1110,2)=\"V*\",\"var\",\"\")","v":""},"*i*","","",92.126300000000001,"6 8 30.3",13.9711," 13 58 15.95",6.85,6.94,"B1V            ","B1","V         ",92.126300000000001,13.9711,4.0599999999999996]
["CCDM J06084+1358AB       ",{"$f":"IF(LEFT(A1111,2)=\"V*\",\"var\",\"\")","v":""},"** ","","",92.126514229999998,"6 8 30.3",13.971058620000001," 13 58 15.81",6.85,6.94,"B1V            ","B1","V         ",92.126514229999998,13.971058620000001,4.0599999999999996]
["BD+13 1124B","","*i*","","",92.126529000000005,"6 8 30.3",13.971064,"+13 58 15.83",7.19,7.3,"B2V            ","B2","V         ",92.126529000000005,13.971064,3.7]
["BD+13 1124D              ",{"$f":"IF(LEFT(A1113,2)=\"V*\",\"var\",\"\")","v":""},"*i*","","",92.133427569999995,"6 8 32",13.96693561," 13 58 0.96",8.2390000000000008,8.327,"B1V            ","B1","V         ",92.133427569999995,13.96693561,2.673]
["HR 2167","","*  ",null,"",92.195964189999998,"6 8 47",8.6694308899999992,"+8 40 9.95",6.48,6.55,"B9V            ","B9","V         ",92.195964189999998,8.6694308899999992,4.45]
["Cl* NGC 2168 HOAG 2","","*iC","","",92.235579999999999,"6 8 56.5",24.359860000000001,"+24 21 35.49",8.24,8.1999999999999993,"B2V            ","B2","V         ",92.235579999999999,24.359860000000001,2.8000000000000007]
["HD 252357","","*  ",null,"",92.280833299999998,"6 9 7.3",19.663246699999998,"+19 39 47.68",9.98,9.82,"B9III          ","B9","III       ",92.280833299999998,19.663246699999998,1.1799999999999997]
["HD 252321                ",{"$f":"IF(LEFT(A1117,2)=\"V*\",\"var\",\"\")","v":""},"*  ","","",92.301213700000005,"6 9 12.2",23.890083099999998," 23 53 24.29",9.35,9.35,"B1V            ","B1","V         ",92.301213700000005,23.890083099999998,1.6500000000000004]
["HD 252409","","*  ","","",92.347281699999996,"6 9 23.3",20.8816542,"+20 52 53.95",9.6199999999999992,9.64,"B3IV           ","B3","IV        ",92.347281699999996,20.8816542,1.3599999999999994]
["Cl* NGC 2168 HOAG 4","","*iC",null,"",92.354579999999999,"6 9 25",24.308420000000002,"+24 18 30.31",9.33,9.1999999999999993,"B7III          ","B7","III       ",92.354579999999999,24.308420000000002,1.8000000000000007]
["Cl* NGC 2168 HOAG 3","","*iC",null,"",92.364379999999997,"6 9 27.4",24.24353,"+24 14 36.7",8.91,8.8000000000000007,"B6III:         ","B6","III:      ",92.364379999999997,24.24353,2.1999999999999993]
["HD 252680","","*iN","","",92.506919600000003,"6 10 1.6",14.075167799999999,"+14 4 30.6",9.18,9.15,"B2V            ","B2","V         ",92.506919600000003,14.075167799999999,1.8499999999999996]
["HD 42352                 ",{"$f":"IF(LEFT(A1122,2)=\"V*\",\"var\",\"\")","v":""},"*  ","","",92.697331669999997,"6 10 47.3",13.65946845," 13 39 34.08",6.9189999999999996,6.9279999999999999,"B1III          ","B1","III       ",92.697331669999997,13.65946845,4.0720000000000001]
["HD 41689                 ",{"$f":"IF(LEFT(A1123,2)=\"V*\",\"var\",\"\")","v":""},"*  ","","",92.729103230000007,"6 10 54.9",62.313746260000002," 62 18 49.48",8.35,8.41,"B1Vn...        ","B1","Vn...     ",92.729103230000007,62.313746260000002,2.59]
["V1388 Ori","Var","Al*","","",92.746522959999993,"6 10 59.1",11.994856670000001,"+11 59 41.48",7.44,7.5,"B2V            ","B2","V         ",92.746522959999993,11.994856670000001,3.5]
["HD 42368","","*  ",null,"",92.766531200000003,"6 11 3.9",17.274606899999998,"+17 16 28.58",8.86,8.91,"B8IV           ","B8","IV        ",92.766531200000003,17.274606899999998,2.09]
["HD 252904","","*  ",null,"",92.777987999999993,"6 11 6.7",18.183097,"+18 10 59.14",8.8249999999999993,8.8859999999999992,"B9V            ","B9","V         ",92.777987999999993,18.183097,2.1140000000000008]
["HD 42434","","*  ",null,"",92.861899600000001,"6 11 26.8",18.248565599999999,"+18 14 54.83",9.0299999999999994,9.0500000000000007,"B9V            ","B9","V         ",92.861899600000001,18.248565599999999,1.9499999999999993]
["HD 253001","","*  ","","",92.867679199999998,"6 11 28.2",19.699768899999999,"+19 41 59.16",9.9499999999999993,9.9499999999999993,"B2V            ","B2","V         ",92.867679199999998,19.699768899999999,1.0500000000000007]
["HD 253049","","*  ","","",92.928817100000003,"6 11 42.9",20.126803899999999,"+20 7 36.49",9.69,9.6199999999999992,"B2IV           ","B2","IV        ",92.928817100000003,20.126803899999999,1.3800000000000008]
["ksi Ori","","*  ","","",92.984987219999994,"6 11 56.3",14.20876543,"+14 12 31.55",4.2880000000000003,4.4420000000000002,"B3IV           ","B3","IV        ",92.984987219999994,14.20876543,6.5579999999999998]
["HD 42597                 ",{"$f":"IF(LEFT(A1131,2)=\"V*\",\"var\",\"\")","v":""},"*  ","","",92.994698659999997,"6 11 58.7",7.3913194300000002," 7 23 28.74",6.96,7.05,"B1V            ","B1","V         ",92.994698659999997,7.3913194300000002,3.95]
["69 Ori","","Em*","Em","",93.013664790000007,"6 12 3.2",16.130405960000001,"+16 7 49.46",4.8129999999999997,4.9470000000000001,"B5Vn            ","B5","Vn        ",93.013664790000007,16.130405960000001,6.0529999999999999]
["69 Ori","","Em*","Em","",93.013664790000007,"6 12 3.2",16.130405960000001,"+16 7 49.46",4.8129999999999997,4.9470000000000001,"B5Vn            ","B5","Vn        ",93.013664790000007,16.130405960000001,6.0529999999999999]
["HD 42655","","*  ","","",93.066394840000001,"6 12 15.9",10.33341791,"+10 20 0.3",7.41,7.49,"B2V            ","B2","V         ",93.066394840000001,10.33341791,3.51]
["HD 253180","","*  ","","",93.072645800000004,"6 12 17.4",21.924980300000001,"+21 55 29.92",9.9,9.68,"B0.5V          ","B0","V         ",93.072645800000004,21.924980300000001,1.3200000000000003]
["HD 253247                ",{"$f":"IF(LEFT(A1136,2)=\"V*\",\"var\",\"\")","v":""},"Y*O","","",93.0921333,"6 12 22.1",18.016080599999999," 18 0 57.89",10.029999999999999,9.75,"B1V            ","B1","V         ",93.0921333,18.016080599999999,1.25]
["HD 253236                ",{"$f":"IF(LEFT(A1137,2)=\"V*\",\"var\",\"\")","v":""},"*  ","","",93.162484199999994,"6 12 38.9",22.8767356," 22 52 36.24",10.050000000000001,9.92,"B1V:           ","B1","V:        ",93.162484199999994,22.8767356,1.08]
["HD 42758","","*  ",null,"",93.295157360000005,"6 13 10.8",19.00925574,"+19 0 33.32",7.34,7.44,"B8III          ","B8","III       ",93.295157360000005,19.00925574,3.5599999999999996]
["HR 2207","","*  ",null,"",93.388551930000006,"6 13 33.2",18.680342370000002,"+18 40 49.23",6.49,6.5839999999999996,"B8Vnn          ","B8","Vnn       ",93.388551930000006,18.680342370000002,4.4160000000000004]
["HD 42908","","Be*","","Be",93.425741799999997,"6 13 42.1",8.7123881399999998,"+8 42 44.59",8.06,8.1,"B2Ve           ","B2","Ve        ",93.425741799999997,8.7123881399999998,2.9000000000000004]
["HD 253659","","Be*","","Be",93.475695799999997,"6 13 54.1",16.518069400000002,"+16 31 5.04",9.56,9.16,"B0.5V:nne      ","B0","V:nne     ",93.475695799999997,16.518069400000002,1.8399999999999999]
["HD 253683","","*  ","","",93.531694200000004,"6 14 7.6",18.9649225,"+18 57 53.72",9.66,9.49,"B0.5IV         ","B0","IV        ",93.531694200000004,18.9649225,1.5099999999999998]
["CCDM J06146+1725AB","","** ",null,"",93.648516999999998,"6 14 35.6",17.417739000000001,"+17 25 3.86",8.27,8.36,"B7III          ","B7","III       ",93.648516999999998,17.417739000000001,2.6400000000000006]
["HD 43044","","*i*",null,"",93.677792679999996,"6 14 42.6",14.586307,"+14 35 10.7",7.04,7.03,"B8V            ","B8","V         ",93.677792679999996,14.586307,3.9699999999999998]
["HD 43060","","*  ","","",93.690053800000001,"6 14 45.6",13.2113461,"+13 12 40.84",8.83,8.85,"B3V            ","B3","V         ",93.690053800000001,13.2113461,2.1500000000000004]
["HD 253928","","*  ",null,"",93.741577899999996,"6 14 57.9",15.6169297,"+15 37 0.94",9.1999999999999993,9.14,"B8V            ","B8","V         ",93.741577899999996,15.6169297,1.8599999999999994]
["HR 2222                  ",{"$f":"IF(LEFT(A1147,2)=\"V*\",\"var\",\"\")","v":""},"*i*","","",93.785302090000002,"6 15 8.4",13.851100199999999," 13 51 3.96",5.67,5.891,"B1V            ","B1","V         ",93.785302090000002,13.851100199999999,5.109]
["LR Gem","Var","bC*","","",93.814324159999998,"6 15 15.4",22.3011342,"+22 18 4.08",9.0500000000000007,8.84,"B0IV           ","B0","IV        ",93.814324159999998,22.3011342,2.16]
["72 Ori","","*  ",null,"",93.854701009999999,"6 15 25.1",16.143172759999999,"+16 8 35.42",5.226,5.327,"B7V            ","B7","V         ",93.854701009999999,16.143172759999999,5.673]
["HD 43186","","*  ",null,"",93.887760799999995,"6 15 33",15.815884199999999,"+15 48 57.18",9.1199999999999992,9.15,"B9V            ","B9","V         ",93.887760799999995,15.815884199999999,1.8499999999999996]
["HR 2231","","Be*",null,"Be",93.91740471,"6 15 40.1",6.0661656900000001,"+6 3 58.19",5.9359999999999999,6.05,"B6Ve           ","B6","Ve        ",93.91740471,6.0661656900000001,4.95]
["73 Ori","","*  ",null,"",93.937354749999997,"6 15 44.9",12.55106791,"+12 33 3.84",5.4729999999999999,5.4729999999999999,"B9II-III       ",{"$f":"+LEFT(L1152,2)","v":"B9"},{"$f":"+IF(MID(L1152,3,1)=\".\",MID(L1152,5,10),MID(L1152,3,10))","v":"II-III    "},93.937354749999997,12.55106791,5.5270000000000001]
["HR 2232","","*  ","","",93.945889269999995,"6 15 47",4.2836348800000001,"+4 17 1.08",6.4589999999999996,6.6109999999999998,"B3IV           ","B3","IV        ",93.945889269999995,4.2836348800000001,4.3890000000000002]
["HR 2246","","*  ",null,"",94.087819400000001,"6 16 21",1.0803465999999999,"+1 4 49.24",6.56,6.6180000000000003,"B6V            ","B6","V         ",94.087819400000001,1.0803465999999999,{"$f":"11-K1154","v":4.3819999999999997}]
["HD 43481","","*  ",null,"",94.227886859999998,"6 16 54.6",14.17208486,"+14 10 19.5",8.61,8.61,"B9V            ","B9","V         ",{"$f":"+F1155","v":94.227886859999998},{"$f":"+H1155","v":14.17208486},2.3900000000000006]
["HR 2248","","*  ",null,"",94.243513070000006,"6 16 58.4",7.0525731699999996,"+7 3 9.26",6.4320000000000004,6.5439999999999996,"B7III          ","B7","III       ",94.243513070000006,7.0525731699999996,4.4560000000000004]
["HD 254577","","*  ","","",94.476605399999997,"6 17 54.3",22.409146700000001,"+22 24 32.92",9.83,9.19,"B0.5II-III     ","B0","II-III    ",94.476605399999997,22.409146700000001,1.8100000000000005]
["HD 43582","","V* ","","",94.501441200000002,"6 18 0.3",22.6583319,"+22 39 29.99",9.11,8.7899999999999991,"B0IIIn         ","B0","IIIn      ",94.501441200000002,22.6583319,2.2100000000000009]
["HD 254699                ",{"$f":"IF(LEFT(A1159,2)=\"V*\",\"var\",\"\")","v":""},"*  ","","",94.606714999999994,"6 18 25.6",23.571446099999999," 23 34 17.2",9.36,9.0500000000000007,"B1V            ","B1","V         ",94.606714999999994,23.571446099999999,1.9499999999999993]
["HD 43703                 ",{"$f":"IF(LEFT(A1160,2)=\"V*\",\"var\",\"\")","v":""},"Be*","","Be",94.664317740000001,"6 18 39.4",23.00793148," 23 0 28.55",8.98,8.65,"B1IV:p...      ","B1","IV:p...   ",94.664317740000001,23.00793148,2.3499999999999996]
["HD 43754","","*  ",null,"",94.692824999999999,"6 18 46.2",19.3420919,"+19 20 31.53",8.7200000000000006,8.6300000000000008,"B9V            ","B9","V         ",94.692824999999999,19.3420919,2.3699999999999992]
["HD 254960","","*  ",null,"",94.706663300000002,"6 18 49.5",13.798629399999999,"+13 47 55.06",9.83,9.64,"B5V             ","B5","V         ",94.706663300000002,13.798629399999999,1.3599999999999994]
["HD 254960","","*  ",null,"",94.706663300000002,"6 18 49.5",13.798629399999999,"+13 47 55.06",9.83,9.64,"B5V             ","B5","V         ",94.706663300000002,13.798629399999999,1.3599999999999994]
["HD 43753","","*  ","","",94.748772250000002,"6 18 59.7",23.00113408,"+23 0 4.08",8.14,7.89,"B0.5III        ","B0","III       ",94.748772250000002,23.00113408,3.1100000000000003]
["V1155 Ori","Var","a2*",null,"",94.757675059999997,"6 19 1.8",17.325256750000001,"+17 19 30.92",6.18,6.2729999999999997,"B9IIIsp...     ","B9","IIIsp...  ",94.757675059999997,17.325256750000001,4.7270000000000003]
["HD 255176","","*  ","","",94.900413299999997,"6 19 36",15.0609839,"+15 3 39.54",9.89,9.91,"B9V            ","B9","V         ",94.900413299999997,15.0609839,1.0899999999999999]
["CCDM J06198+2207ABC      ",{"$f":"IF(LEFT(A1167,2)=\"V*\",\"var\",\"\")","v":""},"** ","","",94.938477800000001,"6 19 45.2",22.110792060000001," 22 6 38.85",9,8.6999999999999993,"B1V:p...       ","B1","V:p...    ",94.938477800000001,22.110792060000001,2.3000000000000007]
["CCDM J06198+2218AB","","** ","","",94.945161999999996,"6 19 46.8",22.304853000000001,"+22 18 17.47",9.48,9.16,"B1.5V          ","B1","V         ",94.945161999999996,22.304853000000001,1.8399999999999999]
["HD 255091","","*  ","","",94.962199600000005,"6 19 50.9",23.825766399999999,"+23 49 32.75",9.6999999999999993,9.57,"B2V            ","B2","V         ",94.962199600000005,23.825766399999999,1.4299999999999997]
["HD 255134                ",{"$f":"IF(LEFT(A1170,2)=\"V*\",\"var\",\"\")","v":""},"*  ","","",94.973778300000006,"6 19 53.7",23.265117499999999," 23 15 54.42",9.4600000000000009,9.18,"B1IVp          ","B1","IVp       ",94.973778300000006,23.265117499999999,1.8200000000000003]
["HD 255168                ",{"$f":"IF(LEFT(A1171,2)=\"V*\",\"var\",\"\")","v":""},"*  ","","",94.999487900000005,"6 19 59.8",23.83559," 23 50 8.12",9.9700000000000006,9.8000000000000007,"B1V            ","B1","V         ",94.999487900000005,23.83559,1.1999999999999993]
["HD 44109","","*  ",null,"",95.071407949999994,"6 20 17.1",7.7188154200000003,"+7 43 7.73",6.72,6.77,"B9V            ","B9","V         ",95.071407949999994,7.7188154200000003,4.2300000000000004]
["HD 255413","","*  ","","",95.113125400000001,"6 20 27.1",13.1047753,"+13 6 17.19",9.2899999999999991,9.2899999999999991,"B9III          ","B9","III       ",95.113125400000001,13.1047753,1.7100000000000009]
["HR 2276","","*  ",null,"",95.217149280000001,"6 20 52.1",11.75622104,"+11 45 22.39",6.4370000000000003,6.5389999999999997,"B5III           ","B5","III       ",95.217149280000001,11.75622104,4.4610000000000003]
["HR 2276","","*  ",null,"",95.217149280000001,"6 20 52.1",11.75622104,"+11 45 22.39",6.4370000000000003,6.5389999999999997,"B5III           ","B5","III       ",95.217149280000001,11.75622104,4.4610000000000003]
["HD 255565","","*  ",null,"",95.240839600000001,"6 20 57.8",15.052921400000001,"+15 3 10.51",9.24,9.2200000000000006,"B8V            ","B8","V         ",95.240839600000001,15.052921400000001,1.7799999999999994]
["HD 44172","","*  ",null,"",95.253242990000004,"6 21 0.7",14.704822439999999,"+14 42 17.36",7.22,7.33,"B6V            ","B6","V         ",95.253242990000004,14.704822439999999,3.67]
["HD 44139","","*  ","","",95.283100000000005,"6 21 7.9",22.1658428,"+22 9 57.03",9.02,8.8000000000000007,"B0.5V          ","B0","V         ",95.283100000000005,22.1658428,2.1999999999999993]
["HD 44171","","*i*",null,"",95.31032725,"6 21 14.4",21.132434249999999,"+21 7 56.76",7.19,7.31,"B8III          ","B8","III       ",95.31032725,21.132434249999999,3.6900000000000004]
["V1028 Ori","Var","bL*","","",95.517404200000001,"6 22 4.1",10.8945817,"+10 53 40.49",9.94,9.86,"B2IV           ","B2","IV        ",95.517404200000001,10.8945817,1.1400000000000006]
["HD 44498","","*  ","","",95.593942510000005,"6 22 22.5",8.3267923100000001,"+8 19 36.45",8.76,8.82,"B2.5V          ","B2","V         ",95.593942510000005,8.3267923100000001,2.1799999999999997]
["HD 256149","","*i*",null,"",95.720813699999994,"6 22 52.9",14.5105494,"+14 30 37.97",9.59,9.4,"B8V            ","B8","V         ",95.720813699999994,14.5105494,1.5999999999999996]
["HD 44585","","*  ",null,"",95.788141479999993,"6 23 9.1",15.84231471,"+15 50 32.33",8.1999999999999993,8.25,"B7V            ","B7","V         ",95.788141479999993,15.84231471,2.75]
["HD 256294","","*i*",null,"",95.788694520000007,"6 23 9.2",8.9074288199999998,"+8 54 26.74",9.56,9.6199999999999992,"B9III          ","B9","III       ",95.788694520000007,8.9074288199999998,1.3800000000000008]
["HD 256358","","*i*",null,"",95.807040000000001,"6 23 13.6",3.8873899999999999,"+3 53 14.6",null,9.1,"B9V            ","B9","V         ",95.807040000000001,3.8873899999999999,1.9000000000000004]
["HR 2292","","*iC",null,"",95.827049239999994,"6 23 18.4",3.7644900200000002,"+3 45 52.16",6.2549999999999999,6.3810000000000002,"B3V            ","B3","V         ",95.827049239999994,3.7644900200000002,4.6189999999999998]
["HD 44637","","Be*","","Be",95.852837550000004,"6 23 24.6",15.10178511,"+15 6 6.42",8.19,8,"B2V:pe         ","B2","V:pe      ",95.852837550000004,15.10178511,3]
["HD 44636","","*  ","","",95.855467899999994,"6 23 25.3",15.8454867,"+15 50 43.75",8.98,9,"B9p            ","B9","p         ",95.855467899999994,15.8454867,2]
["HD 256577","","Be*","","Be",96.000737409999999,"6 24 0.1",8.3006926399999994,"+8 18 2.49",9.7899999999999991,9.77,"B2IV:pe...     ","B2","IV:pe...  ",96.000737409999999,8.3006926399999994,1.2300000000000004]
["HD 256413","","*  ",null,"",96.007569360000005,"6 24 1.8",19.90897296,"+19 54 32.3",9.26,9,"B5III           ","B5","III       ",96.007569360000005,19.90897296,2]
["HD 256413","","*  ",null,"",96.007569360000005,"6 24 1.8",19.90897296,"+19 54 32.3",9.26,9,"B5III           ","B5","III       ",96.007569360000005,19.90897296,2]
["HR 2300","","*  ",null,"",96.009515030000003,"6 24 2.2",8.8850108100000007,"+8 53 6.03",6.1660000000000004,6.2249999999999996,"B8Vn           ","B8","Vn        ",96.009515030000003,8.8850108100000007,4.7750000000000004]
["HD 44674                 ",{"$f":"IF(LEFT(A1193,2)=\"V*\",\"var\",\"\")","v":""},"Be*","","Be",96.016218030000005,"6 24 3.8",25.417004039999998," 25 25 1.21",8.5399999999999991,8.4600000000000009,"B1Vne          ","B1","Vne       ",96.016218030000005,25.417004039999998,2.5399999999999991]
["HD 256733","","*  ",null,"",96.204456699999994,"6 24 49",15.8174458,"+15 49 2.8",9.08,9.0399999999999991,"B8V            ","B8","V         ",96.204456699999994,15.8174458,1.9600000000000009]
["HD 44885","","*  ",null,"",96.209659599999995,"6 24 50.3",13.0159147,"+13 0 57.29",8.92,8.85,"B8V            ","B8","V         ",96.209659599999995,13.0159147,2.1500000000000004]
["HD 44884","","*  ",null,"",96.218878700000005,"6 24 52.5",15.015996100000001,"+15 0 57.58",9.0299999999999994,9.02,"B9V            ","B9","V         ",96.218878700000005,15.015996100000001,1.9800000000000004]
["HR 2297","","*  ",null,"",96.219798699999998,"6 24 52.7",29.707057200000001,"+29 42 25.4",6.6470000000000002,6.702,"B8IIIn         ","B8","IIIn      ",96.219798699999998,29.707057200000001,4.298]
["HD 256791","","*  ",null,"",96.224132499999996,"6 24 53.7",13.9038922,"+13 54 14.01",9.4,9.3000000000000007,"B6IV           ","B6","IV        ",96.224132499999996,13.9038922,1.6999999999999993]
["HD 44944","","*i*",null,"",96.254069099999995,"6 25 0.9",10.51757617,"+10 31 3.27",8.06,7.8,"B9IV           ","B9","IV        ",96.254069099999995,10.51757617,3.2]
["HD 256816","","*  ",null,"",96.291463800000002,"6 25 9.9",16.107407500000001,"+16 6 26.66",9.26,9.15,"B5V             ","B5","V         ",96.291463800000002,16.107407500000001,1.8499999999999996]
["HD 256816","","*  ",null,"",96.291463800000002,"6 25 9.9",16.107407500000001,"+16 6 26.66",9.26,9.15,"B5V             ","B5","V         ",96.291463800000002,16.107407500000001,1.8499999999999996]
["HD 256856","","*  ","","",96.296288700000005,"6 25 11.1",14.873200300000001,"+14 52 23.52",9.36,9.3000000000000007,"B3V            ","B3","V         ",96.296288700000005,14.873200300000001,1.6999999999999993]
["HR 2312","","*  ",null,"",96.327016610000001,"6 25 18.4",1.5015163199999999,"+1 30 5.45",6.6349999999999998,6.6619999999999999,"B9V            ","B9","V         ",96.327016610000001,1.5015163199999999,4.3380000000000001]
["HD 45025","","*  ",null,"",96.415414200000001,"6 25 39.6",13.271051099999999,"+13 16 15.78",8.59,8.69,"B8V            ","B8","V         ",96.415414200000001,13.271051099999999,2.3100000000000005]
["HD 257051","","*  ",null,"",96.470084600000007,"6 25 52.8",15.6234392,"+15 37 24.38",9.7200000000000006,9.5500000000000007,"B8V            ","B8","V         ",96.470084600000007,15.6234392,1.4499999999999993]
["HD 45006","","*  ",null,"",96.584937269999998,"6 26 20.3",29.630662969999999,"+29 37 50.38",8.94,8.93,"B9V            ","B9","V         ",96.584937269999998,29.630662969999999,2.0700000000000003]
["HD 45180","","*  ",null,"",96.657215170000001,"6 26 37.7",15.52369697,"+15 31 25.3",6.86,6.92,"B9V            ","B9","V         ",96.657215170000001,15.52369697,4.08]
["HD 45337","","*  ",null,"",97.016787100000002,"6 28 4",28.610790300000001,"+28 36 38.84",9.1199999999999992,9.1999999999999993,"B5V             ","B5","V         ",97.016787100000002,28.610790300000001,1.8000000000000007]
["HD 45337","","*  ",null,"",97.016787100000002,"6 28 4",28.610790300000001,"+28 36 38.84",9.1199999999999992,9.1999999999999993,"B5V             ","B5","V         ",97.016787100000002,28.610790300000001,1.8000000000000007]
["HR 2347","","*  ",null,"",97.069865089999993,"6 28 16.7",1.91267845,"+1 54 45.64",6.4169999999999998,6.4619999999999997,"B9V            ","B9","V         ",97.069865089999993,1.91267845,4.5380000000000003]
["HD 257971","","*  ","","",97.163956929999998,"6 28 39.3",11.297084829999999,"+11 17 49.5",8.9,8.89,"B0.5III        ","B0","III       ",97.163956929999998,11.297084829999999,2.1099999999999994]
["HD 257672","","*  ",null,"",97.178218700000002,"6 28 42.7",29.770084399999998,"+29 46 12.3",9.5,9.48,"B9V            ","B9","V         ",97.178218700000002,29.770084399999998,1.5199999999999996]
["18 Gem","","*  ",null,"",97.240775560000003,"6 28 57.7",20.212134899999999,"+20 12 43.68",4,4.1399999999999997,"B6IIIe         ","B6","IIIe      ",97.240775560000003,20.212134899999999,6.86]
["HD 257926","","*  ",null,"",97.335107100000002,"6 29 20.4",29.634433600000001,"+29 38 3.96",9.74,9.7799999999999994,"B9V            ","B9","V         ",97.335107100000002,29.634433600000001,1.2200000000000006]
["HD 45623","","V* ",null,"",97.414533280000001,"6 29 39.4",28.780676639999999,"+28 46 50.43",7.49,7.54,"B5V             ","B5","V         ",97.414533280000001,28.780676639999999,3.46]
["HD 45623","","V* ",null,"",97.414533280000001,"6 29 39.4",28.780676639999999,"+28 46 50.43",7.49,7.54,"B5V             ",{"$f":"+LEFT(L1216,2)","v":"B5"},{"$f":"+IF(MID(L1216,3,1)=\".\",MID(L1216,5,10),MID(L1216,3,10))","v":"V         "},97.414533280000001,28.780676639999999,3.46]
["HD 258052","","*  ",null,"",97.419738300000006,"6 29 40.7",28.8940825,"+28 53 38.69",9.52,9.5299999999999994,"B9V            ","B9","V         ",97.419738300000006,28.8940825,1.4700000000000006]
["HD 45789","","** ","","",97.483138409999995,"6 29 55.9",7.11198614,"+7 6 43.15",6.97,7.1,"B2.5IV-V       ","B2","IV-V      ",97.483138409999995,7.11198614,{"$f":"11-K1218","v":3.9000000000000004}]
["HD 45901","","Be*","","Be",97.573455269999997,"6 30 17.6",2.8478937000000002,"+2 50 52.41",9.1199999999999992,8.8699999999999992,"B2Ve           ","B2","Ve        ",{"$f":"+F1219","v":97.573455269999997},{"$f":"+H1219","v":2.8478937000000002},2.1300000000000008]
["HD 45911","","*i*","","",97.621728289999993,"6 30 29.2",4.3324465500000002,"+4 19 56.8",7.22,7.36,"B2IV-V         ","B2","IV-V      ",97.621728289999993,4.3324465500000002,3.6399999999999997]
["HD 45910","","Be*","","Be",97.637241320000001,"6 30 32.9",5.8670013599999997,"+5 52 1.2",6.97,6.74,"B2IIIe         ","B2","IIIe      ",97.637241320000001,5.8670013599999997,4.26]
["HD 258756","","*iC",null,"",97.692926200000002,"6 30 46.3",4.6001988999999996,"+4 36 0.71",9.93,9.94,"B8V            ","B8","V         ",97.692926200000002,4.6001988999999996,1.0600000000000005]
["BD+10 1158A","","*i*",null,"",97.696054000000004,"6 30 47",10.062875,"+10 3 46.35",9.3170000000000002,9.3970000000000002,"B7IIIp         ","B7","IIIp      ",97.696054000000004,10.062875,1.6029999999999998]
["HD 258686","","** ",null,"",97.696065579999996,"6 30 47",10.06289743,"+10 3 46.43",9.25,9.34,"B7IIIp         ","B7","IIIp      ",97.696065579999996,10.06289743,1.6600000000000001]
["CCDM J06309+0439AB","","** ",null,"",97.718480799999995,"6 30 52.4",4.6499630999999999,"+4 38 59.86",9.0399999999999991,9.06,"B8V            ","B8","V         ",97.718480799999995,4.6499630999999999,1.9399999999999995]
["HD 258749","","*iN",null,"",97.7413083,"6 30 57.9",9.8096060999999999,"+9 48 34.58",9.92,9.99,"B5III           ","B5","III       ",97.7413083,9.8096060999999999,1.0099999999999998]
["HD 258749","","*iN",null,"",97.7413083,"6 30 57.9",9.8096060999999999,"+9 48 34.58",9.92,9.99,"B5III           ","B5","III       ",97.7413083,9.8096060999999999,1.0099999999999998]
["V727 Mon","Var","bL*",null,"",97.788930190000002,"6 31 9.3",9.9398136000000008,"+9 56 23.32",8.19,8,"B8V            ","B8","V         ",97.788930190000002,9.9398136000000008,3]
["HR 2370","","Be*","","Be",97.78984561,"6 31 9.5",11.251376949999999,"+11 15 4.95",6.03,6.14,"B2V:nne        ","B2","V:nne     ",97.78984561,11.251376949999999,4.8600000000000003]
["CCDM J06316+0451A","","*i*","","",97.889437000000001,"6 31 33.4",4.8443610000000001,"+4 50 39.69",9.5299999999999994,9.39,"B0.5V          ","B0","V         ",97.889437000000001,4.8443610000000001,1.6099999999999994]
["HD 259012                ",{"$f":"IF(LEFT(A1231,2)=\"V*\",\"var\",\"\")","v":""},"*  ","","",97.889448700000003,"6 31 33.4",4.8443607999999996," 4 50 39.69",9.4,9.27,"B1Vn           ","B1","Vn        ",97.889448700000003,4.8443607999999996,1.7300000000000004]
["HR 2374","","*  ",null,"",97.914085569999997,"6 31 39.3",11.79227141,"+11 47 32.17",6.53,6.65,"B6III          ","B6","III       ",97.914085569999997,11.79227141,4.3499999999999996]
["HD 259105                ",{"$f":"IF(LEFT(A1233,2)=\"V*\",\"var\",\"\")","v":""},"*i*","","",97.966677500000003,"6 31 52",4.9325752999999999," 4 55 57.27",9.57,9.4190000000000005,"B1V            ","B1","V         ",97.966677500000003,4.9325752999999999,1.5809999999999995]
["HD 258763","","*  ",null,"",97.976572099999998,"6 31 54.3",29.359829399999999,"+29 21 35.38",9.4,9.4,"B9V            ","B9","V         ",97.976572099999998,29.359829399999999,1.5999999999999996]
["HD 259103","","*iC","","",97.997165800000005,"6 31 59.3",6.7858460999999997,"+6 47 9.04",9.92,9.8800000000000008,"B9V            ","B9","V         ",97.997165800000005,6.7858460999999997,1.1199999999999992]
["BD+04 1299s              ",{"$f":"IF(LEFT(A1236,2)=\"V*\",\"var\",\"\")","v":""},"*iC","","",98.025563000000005,"6 32 6.1",4.8709249999999997," 4 52 15.32",9.8989999999999991,9.7349999999999994,"B1III          ","B1","III       ",98.025563000000005,4.8709249999999997,1.2650000000000006]
["HD 46179","","*iC",null,"",98.029749719999998,"6 32 7.1",6.0356487400000001,"+6 2 8.33",6.6580000000000004,6.702,"B9V            ","B9","V         ",98.029749719999998,6.0356487400000001,4.298]
["HD 259163","","*iC","","",98.065203999999994,"6 32 15.6",9.1436309999999992,"+9 8 37.07",9.43,9.41,"B3III          ","B3","III       ",98.065203999999994,9.1436309999999992,1.5899999999999999]
["HD 259440","","Be*","","Be",98.246893700000001,"6 32 59.2",5.8003271999999999,"+5 48 1.17",9.58,9.1199999999999992,"B0pe           ","B0","pe        ",98.246893700000001,5.8003271999999999,1.8800000000000008]
["HD 259431","","Or*",null,"",98.271627539999997,"6 33 5.1",10.32221859,"+10 19 19.98",9.0299999999999994,8.81,"B6pe           ","B6","pe        ",98.271627539999997,10.32221859,2.1899999999999995]
["HD 259476","","*iC",null,"",98.275508299999998,"6 33 6.1",7.0669982999999998,"+7 4 1.19",9.94,9.76,"B8III          ","B8","III       ",98.275508299999998,7.0669982999999998,1.2400000000000002]
["HD 46388","","*iC",null,"",98.334692500000003,"6 33 20.3",4.6494660999999997,"+4 38 58.07",9.35,9.1999999999999993,"B6V            ","B6","V         ",98.334692500000003,4.6494660999999997,1.8000000000000007]
["HD 259276","","*  ",null,"",98.380387499999998,"6 33 31.2",28.6583814,"+28 39 30.17",9.8000000000000007,9.76,"B9V            ","B9","V         ",98.380387499999998,28.6583814,1.2400000000000002]
["HD 259634","","*iC",null,"",98.394412000000003,"6 33 34.6",5.2952360000000001,"+5 17 42.84",9.98,9.9,"B9III          ","B9","III       ",98.394412000000003,5.2952360000000001,1.0999999999999996]
["HD 46469","","*iC","","",98.453022899999993,"6 33 48.7",5.4804214,"+5 28 49.51",8.64,8.5500000000000007,"B2V            ","B2","V         ",98.453022899999993,5.4804214,2.4499999999999993]
["HD 46484                 ",{"$f":"IF(LEFT(A1246,2)=\"V*\",\"var\",\"\")","v":""},"*iC","","",98.476703090000001,"6 33 54.4",4.6623903599999998," 4 39 44.6",8,7.65,"B1V            ","B1","V         ",98.476703090000001,4.6623903599999998,3.3499999999999996]
["HD 259448","","*  ",null,"",98.533420000000007,"6 34 8",30.994716400000001,"+30 59 40.97",9.4499999999999993,9.4700000000000006,"B9V            ","B9","V         ",98.533420000000007,30.994716400000001,1.5299999999999994]
["HD 259831","","*iC",null,"",98.553976700000007,"6 34 12.9",6.6778136000000003,"+6 40 40.12",9.9600000000000009,9.7799999999999994,"B7III          ","B7","III       ",98.553976700000007,6.6778136000000003,1.2200000000000006]
["HD 259517","","*  ",null,"",98.571688699999996,"6 34 17.2",29.2791681,"+29 16 45",9.7100000000000009,9.76,"B9V            ","B9","V         ",98.571688699999996,29.2791681,1.2400000000000002]
["HD 259895","","*iC",null,"",98.593500000000006,"6 34 22.4",5.2020499999999998,"+5 12 7.37",9.89,9.84,"B5V             ","B5","V         ",98.593500000000006,5.2020499999999998,1.1600000000000001]
["HD 259895","","*iC",null,"",98.593500000000006,"6 34 22.4",5.2020499999999998,"+5 12 7.37",9.89,9.84,"B5V             ","B5","V         ",98.593500000000006,5.2020499999999998,1.1600000000000001]
["HD 259954","","*iC","","",98.650674249999994,"6 34 36.1",8.3521433700000003,"+8 21 7.71",9.19,9.1300000000000008,"B2IV           ","B2","IV        ",98.650674249999994,8.3521433700000003,1.8699999999999992]
["HD 259991","","*iC",null,"",98.690571300000002,"6 34 45.7",8.0756861000000004,"+8 4 32.46",9.48,9.31,"B8V            ","B8","V         ",98.690571300000002,8.0756861000000004,1.6899999999999995]
["RW Mon","Var","Al*",null,"",98.69120916,"6 34 45.8",8.8256067100000006,"+8 49 32.18",9.3800000000000008,9.32,"B8V+G5IV       ","B8","V+G5IV    ",98.69120916,8.8256067100000006,1.6799999999999997]
["HD 259983","","*iC","","",98.691272499999997,"6 34 45.9",9.8122319000000005,"+9 48 44.03",9.9600000000000009,9.91,"B9V            ","B9","V         ",98.691272499999997,9.8122319000000005,1.0899999999999999]
["HD 46660                 ",{"$f":"IF(LEFT(A1256,2)=\"V*\",\"var\",\"\")","v":""},"*i*","","",98.751527479999993,"6 35 0.3",11.12442306," 11 7 27.92",8.27,8.0399999999999991,"B1V            ","B1","V         ",98.751527479999993,11.12442306,2.9600000000000009]
["HD 260153","","*iC",null,"",98.793401700000004,"6 35 10.4",6.5716878000000003,"+6 34 18.07",9.7200000000000006,9.6300000000000008,"B8III          ","B8","III       ",98.793401700000004,6.5716878000000003,1.3699999999999992]
["HD 46592","","*  ",null,"",98.893843700000005,"6 35 34.5",30.4156108,"+30 24 56.19",8.89,8.9600000000000009,"B5V             ","B5","V         ",98.893843700000005,30.4156108,2.0399999999999991]
["HD 46592","","*  ",null,"",98.893843700000005,"6 35 34.5",30.4156108,"+30 24 56.19",8.89,8.9600000000000009,"B5V             ","B5","V         ",98.893843700000005,30.4156108,2.0399999999999991]
["HD 46847","","*  ","","",98.932438700000006,"6 35 43.7",2.7119086000000001,"+2 42 42.87",9.56,8.9700000000000006,"B0III:p        ","B0","III:p     ",98.932438700000006,2.7119086000000001,2.0299999999999994]
["HD 260302","","*iC",null,"",98.939324999999997,"6 35 45.4",7.9851368999999996,"+7 59 6.49",9.7200000000000006,9.6,"B9V            ","B9","V         ",98.939324999999997,7.9851368999999996,1.4000000000000004]
["HD 260363","","*iC",null,"",98.9648988,"6 35 51.5",6.1054463999999999,"+6 6 19.6",10.09,9.9,"B8V            ","B8","V         ",98.9648988,6.1054463999999999,1.0999999999999996]
["HD 46846","","*iC","","",98.972349199999996,"6 35 53.3",5.8424136000000004,"+5 50 32.68",9.09,8.85,"B3V            ","B3","V         ",98.972349199999996,5.8424136000000004,2.1500000000000004]
["HD 46867","","*i*","","",98.979749139999996,"6 35 55.1",5.3097737800000004,"+5 18 35.18",8.4700000000000006,8.34,"B0.5III-IV     ","B0","III-IV    ",98.979749139999996,5.3097737800000004,2.66]
["HR 2413","","*iC","","",99.000440990000001,"6 36 0.1",4.4980324600000001,"+4 29 52.91",6.4989999999999997,6.5570000000000004,"B9III          ","B9","III       ",99.000440990000001,4.4980324600000001,4.4429999999999996]
["HD 260095","","*  ",null,"",99.015350400000003,"6 36 3.6",30.623985300000001,"+30 37 26.34",9.5500000000000007,9.6,"B8V            ","B8","V         ",99.015350400000003,30.623985300000001,1.4000000000000004]
["HD 260479","","*iC",null,"",99.089930800000005,"6 36 21.5",9.1440867000000008,"+9 8 38.71",9.84,9.7899999999999991,"B3V            ","B3","V         ",99.089930800000005,9.1440867000000008,1.2100000000000009]
["HD 260537","","*iC",null,"",99.134214709999995,"6 36 32.2",7.7103541299999998,"+7 42 37.27",9.48,9.48,"B5V             ","B5","V         ",99.134214709999995,7.7103541299999998,1.5199999999999996]
["HD 260537","","*iC",null,"",99.134214709999995,"6 36 32.2",7.7103541299999998,"+7 42 37.27",9.48,9.48,"B5V             ","B5","V         ",99.134214709999995,7.7103541299999998,1.5199999999999996]
["HD 47032","","*  ","","",99.194169279999997,"6 36 46.6",4.6944793599999999,"+4 41 40.12",9.25,8.89,"B0III          ","B0","III       ",99.194169279999997,4.6944793599999999,2.1099999999999994]
["HD 260594","","*iC",null,"",99.207978299999994,"6 36 49.9",10.616507800000001,"+10 36 59.42",9.5299999999999994,9.61,"B8V            ","B8","V         ",99.207978299999994,10.616507800000001,1.3900000000000006]
["HD 47089","","*iC",null,"",99.288933299999997,"6 37 9.3",4.6549261,"+4 39 17.73",9.19,9.2799999999999994,"B5III           ","B5","III       ",99.288933299999997,4.6549261,1.7200000000000006]
["HD 47089","","*iC",null,"",99.288933299999997,"6 37 9.3",4.6549261,"+4 39 17.73",9.19,9.2799999999999994,"B5III           ","B5","III       ",99.288933299999997,4.6549261,1.7200000000000006]
["V* V649 Mon              ",{"$f":"IF(LEFT(A1274,2)=\"V*\",\"var\",\"\")","v":"var"},"El*","","",99.293406300000001,"6 37 10.4",6.0591653000000001," 6 3 32.99",7.53,7.59,"B1III          ","B1","III       ",99.293406300000001,6.0591653000000001,3.41]
["HD 260611","","*  ","","",99.428435800000003,"6 37 42.8",29.466604400000001,"+29 27 59.77",8.84,8.98,"B3III          ","B3","III       ",99.428435800000003,29.466604400000001,2.0199999999999996]
["HD 47104","","*  ",null,"",99.44093067,"6 37 45.8",18.401567199999999,"+18 24 5.64",7.5,7.58,"B8V            ","B8","V         ",99.44093067,18.401567199999999,3.42]
["HD 261021","","*iC","","",99.463384199999993,"6 37 51.2",3.6204285999999999,"+3 37 13.54",10.07,9.6999999999999993,"B2III          ","B2","III       ",99.463384199999993,3.6204285999999999,1.3000000000000007]
["HD 47272","","*iC",null,"",99.490795800000001,"6 37 57.7",4.2585708000000002,"+4 15 30.85",7.65,7.62,"B9V            ","B9","V         ",99.490795800000001,4.2585708000000002,3.38]
["HD 47292","","V* ",null,"",99.549374220000004,"6 38 11.8",7.1482288,"+7 8 53.62",7.53,7.45,"B8V            ","B8","V         ",99.549374220000004,7.1482288,3.55]
["53 Aur","","*  ",null,"",99.595867799999994,"6 38 23",28.984352789999999,"+28 59 3.67",5.76,5.7480000000000002,"B9Mn+F0m       ",{"$f":"+LEFT(L1280,2)","v":"B9"},{"$f":"+IF(MID(L1280,3,1)=\".\",MID(L1280,5,10),MID(L1280,3,10))","v":"Mn+F0m    "},99.595867799999994,28.984352789999999,5.2519999999999998]
["V732 Mon","Var","LP*","","",99.596301150000002,"6 38 23.1",4.6241525899999996,"+4 37 26.94",8.25,8.18,"B0.5V          ","B0","V         ",99.596301150000002,4.6241525899999996,2.8200000000000003]
["HD 47359","","Be*","","Be",99.603765800000005,"6 38 24.9",4.8809288999999998,"+4 52 51.34",9.11,8.8699999999999992,"B0.5Vpe...     ","B0","Vpe...    ",99.603765800000005,4.8809288999999998,{"$f":"11-K1282","v":2.1300000000000008}]
["HD 47382","","*iC","","",99.619322600000004,"6 38 28.6",4.6071873300000004,"+4 36 25.87",7.25,7.16,"B0III          ","B0","III       ",{"$f":"+F1283","v":99.619322600000004},{"$f":"+H1283","v":4.6071873300000004},3.84]
["HD 47398                 ",{"$f":"IF(LEFT(A1284,2)=\"V*\",\"var\",\"\")","v":""},"*iC","","",99.652884999999998,"6 38 36.6",4.6268402999999996," 4 37 36.62",8.75,8.69,"B1V            ","B1","V         ",99.652884999999998,4.6268402999999996,2.3100000000000005]
["HD 261235","","*iC","","",99.655402899999999,"6 38 37.2",4.2563830999999999,"+4 15 22.97",9.7200000000000006,9.7100000000000009,"B2III          ","B2","III       ",99.655402899999999,4.2563830999999999,1.2899999999999991]
["V689 Mon","Var","Pu*","","",99.659113070000004,"6 38 38.1",1.61352224,"+1 36 48.68",6.3109999999999999,6.2359999999999998,"O9.5III          ","O9","III       ",99.659113070000004,1.61352224,4.7640000000000002]
["HD 47417","","*iC","","",99.699687449999999,"6 38 47.9",6.9018834599999996,"+6 54 6.78",6.91,6.95,"B0IV           ","B0","IV        ",99.699687449999999,6.9018834599999996,4.05]
["[SC93] 335","","UV ","","",99.7,"6 38 47.9",4.5199999999999996,"+4 31 11.99",null,6.62,"B0III          ","B0","III       ",99.7,4.5199999999999996,4.38]
["52 Aur","","*  ",null,"",99.704916699999998,"6 38 49.1",39.90255973,"+39 54 9.21",5.2640000000000002,5.3390000000000004,"B8III          ","B8","III       ",99.704916699999998,39.90255973,5.6609999999999996]
["HR 2441","","*iC",null,"",99.70585604,"6 38 49.4",4.7006093499999997,"+4 42 2.19",6.4829999999999997,6.5549999999999997,"B8IIIn         ","B8","IIIn      ",99.70585604,4.7006093499999997,4.4450000000000003]
["HD 47430","","*iC",null,"",99.714524080000004,"6 38 51.4",5.6857338200000003,"+5 41 8.64",8.34,8.49,"B8V            ","B8","V         ",99.714524080000004,5.6857338200000003,2.5099999999999998]
["HD 47469","","*  ",null,"",99.796548299999998,"6 39 11.1",9.6459638999999999,"+9 38 45.47",7.67,7.8,"B5V             ","B5","V         ",99.796548299999998,9.6459638999999999,3.2]
["HD 47469","","*  ",null,"",99.796548299999998,"6 39 11.1",9.6459638999999999,"+9 38 45.47",7.67,7.8,"B5V             ","B5","V         ",99.796548299999998,9.6459638999999999,3.2]
["CCDM J06396+2816AB","","** ",null,"",99.887998530000004,"6 39 33.1",28.263131680000001,"+28 15 47.27",5.9539999999999997,6.048,"B7III          ","B7","III       ",99.887998530000004,28.263131680000001,4.952]
["HD 261490","","*iC","","",99.892917089999997,"6 39 34.3",8.35038065,"+8 21 1.37",9.09,8.91,"B2III...       ","B2","III...    ",99.892917089999997,8.35038065,2.09]
["HD 47553","","*iC",null,"",99.895896699999994,"6 39 35",10.2406106,"+10 14 26.19",8.5,8.5399999999999991,"B9III          ","B9","III       ",99.895896699999994,10.2406106,2.4600000000000009]
["HD 47651","","*iC",null,"",99.960236699999996,"6 39 50.4",4.7257766999999999,"+4 43 32.79",8.94,8.8800000000000008,"B8V            ","B8","V         ",99.960236699999996,4.7257766999999999,2.1199999999999992]
["HD 47633","","*iC",null,"",99.971596230000003,"6 39 53.1",6.0569444700000004,"+6 3 25",7.96,8,"B9V            ","B9","V         ",99.971596230000003,6.0569444700000004,3]
["HD 47662","","*iC",null,"",100.0557031,"6 40 13.3",10.441314889999999,"+10 26 28.73",8.64,8.75,"B7V...         ","B7","V...      ",100.0557031,10.441314889999999,2.25]
["HD 47733","","*iC",null,"",100.07209801,"6 40 17.3",4.9114123100000002,"+4 54 41.08",9.06,9.17,"B6IV           ","B6","IV        ",100.07209801,4.9114123100000002,1.83]
["HD 261762","","*iC",null,"",100.112055,"6 40 26.8",6.6197672000000001,"+6 37 11.16",10.06,9.9600000000000009,"B9V            ","B9","V         ",100.112055,6.6197672000000001,1.0399999999999991]
["V641 Mon","Var","El*","","",100.11910880000001,"6 40 28.5",9.8178543299999994,"+9 49 4.27",7.98,8.1,"B3Vnn...       ","B3","Vnn...    ",100.11910880000001,9.8178543299999994,2.9000000000000004]
["HD 261818","","*iC",null,"",100.1243958,"6 40 29.8",4.1729158000000002,"+4 10 22.49",9.6199999999999992,9.57,"B9V            ","B9","V         ",100.1243958,4.1729158000000002,1.4299999999999997]
["HR 2454","","*iC",null,"",100.13310813,"6 40 31.9",6.3712508300000001,"+6 22 16.5",6.375,6.4939999999999998,"B8IIIs...      ","B8","IIIs...   ",100.13310813,6.3712508300000001,4.5060000000000002]
["HD 47754","","*iC",null,"",100.15219691999999,"6 40 36.5",10.391957850000001,"+10 23 31.04",8.6999999999999993,8.82,"B9V            ","B9","V         ",100.15219691999999,10.391957850000001,2.1799999999999997]
["HD 261811","","*iC",null,"",100.1580546,"6 40 37.9",8.4999569000000008,"+8 29 59.84",9.32,9.1199999999999992,"B8V            ","B8","V         ",100.1580546,8.4999569000000008,1.8800000000000008]
["HD 47777","","pr*","","",100.17622016,"6 40 42.2",9.6559187499999997,"+9 39 21.3",7.78,7.95,"B3V            ","B3","V         ",100.17622016,9.6559187499999997,3.05]
["HD 261838","","*iC",null,"",100.2102575,"6 40 50.4",11.3465547,"+11 20 47.59",10.29,9.98,"B8III          ","B8","III       ",100.2102575,11.3465547,1.0199999999999996]
["CCDM J06410+0542AB","","** ","","",100.25018799999999,"6 41 0",5.7075690000000003,"+5 42 27.24",8.4,9,"B9V            ","B9","V         ",100.25018799999999,5.7075690000000003,2]
["HD 261938","","*iC",null,"",100.257808,"6 41 1.8",9.8799890000000001,"+9 52 47.96",8.9,8.9700000000000006,"B6V            ","B6","V         ",100.257808,9.8799890000000001,2.0299999999999994]
["HD 261944","","*iC",null,"",100.264346,"6 41 3.4",7.9030060000000004,"+7 54 10.82",9.9700000000000006,9.7799999999999994,"B8V            ","B8","V         ",100.264346,7.9030060000000004,1.2200000000000006]
["HR 2461","","*  ",null,"",100.27266932000001,"6 41 5.4",0.49532744000000001,"+0 29 43.17",5.6829999999999998,5.7789999999999999,"B8III          ","B8","III       ",100.27266932000001,0.49532744000000001,5.2210000000000001]
["HD 262023","","*iC",null,"",100.28245800000001,"6 41 7.7",6.0387529999999998,"+6 2 19.51",9.43,9.44,"B9V            ","B9","V         ",100.28245800000001,6.0387529999999998,1.5600000000000005]
["HD 47887","","pr*","","",100.2900096,"6 41 9.6",9.4659846999999999,"+9 27 57.54",6.97,7.17,"B2III:         ","B2","III:      ",100.2900096,9.4659846999999999,3.83]
["BD+09 1344B","","*i*",null,"",100.2908,"6 41 9.7",9.4621999999999993,"+9 27 43.91",11,9.6,"B9V            ","B9","V         ",100.2908,9.4621999999999993,1.4000000000000004]
["HD 261969","","Y*O","","",100.29325,"6 41 10.3",9.8838600000000003,"+9 53 1.89",9.9499999999999993,9.9499999999999993,"B9IV           ","B9","IV        ",100.29325,9.8838600000000003,1.0500000000000007]
["HD 262042","","*iC","","",100.32798750000001,"6 41 18.7",9.2136317000000005,"+9 12 49.07",9.0500000000000007,9.02,"B2V            ","B2","V         ",100.32798750000001,9.2136317000000005,1.9800000000000004]
["HD 47985","","*iC","","",100.3548883,"6 41 25.1",4.0096746999999997,"+4 0 34.82",9.27,9.3000000000000007,"B9V            ","B9","V         ",100.3548883,4.0096746999999997,1.6999999999999993]
["HD 47961","","pr*","","",100.36376507999999,"6 41 27.3",9.8540021400000004,"+9 51 14.4",7.34,7.51,"B2V...         ","B2","V...      ",100.36376507999999,9.8540021400000004,3.49]
["HD 262145","","*iC","","",100.3659779,"6 41 27.8",4.6521292000000001,"+4 39 7.66",10,9.82,"B3V            ","B3","V         ",100.3659779,4.6521292000000001,1.1799999999999997]
["HD 47984","","*iC",null,"",100.37427588,"6 41 29.8",6.1108241100000003,"+6 6 38.96",7.2009999999999996,7,"B9V            ","B9","V         ",100.37427588,6.1108241100000003,4]
["HD 262143","","*iC",null,"",100.3971817,"6 41 35.3",6.1939278,"+6 11 38.14",9.58,9.5,"B8V            ","B8","V         ",100.3971817,6.1939278,1.5]
["HD 48055","","V* ","","",100.45713139999999,"6 41 49.7",9.5081581899999996,"+9 30 29.36",8.85,9,"B3V            ","B3","V         ",100.45713139999999,9.5081581899999996,2]
["HD 262538","","*iC",null,"",100.6966642,"6 42 47.1",4.4715043999999997,"+4 28 17.41",9.4499999999999993,9.41,"B3III          ","B3","III       ",100.6966642,4.4715043999999997,1.5899999999999999]
["HD 262568","","*iC",null,"",100.78039130000001,"6 43 7.2",7.7523460999999996,"+7 45 8.44",10.33,9.9700000000000006,"B8V            ","B8","V         ",100.78039130000001,7.7523460999999996,1.0299999999999994]
["HD 48347","","*  ",null,"",100.81356443,"6 43 15.2",6.1169909200000001,"+6 7 1.16",8.08,8,"B9V            ","B9","V         ",100.81356443,6.1169909200000001,3]
["HR 2479","","*  ","","",100.91102375,"6 43 38.6",3.9325300300000001,"+3 55 57.1",5.8250000000000002,5.8730000000000002,"B0III          ","B0","III       ",100.91102375,3.9325300300000001,5.1269999999999998]
["HD 262843","","*iC",null,"",101.0010292,"6 44 0.2",7.8388586,"+7 50 19.89",9.94,9.94,"B9V            ","B9","V         ",101.0010292,7.8388586,1.0600000000000005]
["HD 48533","","*  ",null,"",101.0396767,"6 44 9.5",6.1941531000000003,"+6 11 38.95",8.5,8.34,"B8V            ","B8","V         ",101.0396767,6.1941531000000003,2.66]
["HD 48691","","*  ","","",101.15230701,"6 44 36.5",0.58930653,"+0 35 21.5",7.88,7.87,"B0.5IV         ","B0","IV        ",101.15230701,0.58930653,3.13]
["HD 48532","","*  ","","",101.16051446,"6 44 38.5",19.987616890000002,"+19 59 15.42",8.59,8.65,"B2V:           ","B2","V:        ",101.16051446,19.987616890000002,2.3499999999999996]
["HD 48615                 ",{"$f":"IF(LEFT(A1332,2)=\"V*\",\"var\",\"\")","v":""},"*  ","","",101.21344670000001,"6 44 51.2",12.0781253," 12 4 41.25",9.1199999999999992,9.07,"B1V            ","B1","V         ",101.21344670000001,12.0781253,1.9299999999999997]
["HD 48663                 ",{"$f":"IF(LEFT(A1333,2)=\"V*\",\"var\",\"\")","v":""},"*i*","","",101.26162669999999,"6 45 2.7",12.2464975," 12 14 47.39",8.61,8.6300000000000008,"B1V            ","B1","V         ",101.26162669999999,12.2464975,2.3699999999999992]
["HD 48752","","*  ",null,"",101.30773670000001,"6 45 13.8",9.6878419000000005,"+9 41 16.23",8.32,8.36,"B9V            ","B9","V         ",101.30773670000001,9.6878419000000005,2.6400000000000006]
["HD 263283","","*iC",null,"",101.3292046,"6 45 19",8.0369168999999996,"+8 2 12.9",10.09,9.9700000000000006,"B8V            ","B8","V         ",101.3292046,8.0369168999999996,1.0299999999999994]
["HD 48785","","*  ",null,"",101.3435479,"6 45 22.4",5.8393949999999997,"+5 50 21.82",9.16,9.18,"B9V            ","B9","V         ",101.3435479,5.8393949999999997,1.8200000000000003]
["HD 263558","","*iC",null,"",101.56913299999999,"6 46 16.5",7.8512469999999999,"+7 51 4.48",9.7200000000000006,9.59,"B8V            ","B8","V         ",101.56913299999999,7.8512469999999999,1.4100000000000001]
["HD 48955","","*  ",null,"",101.5802662,"6 46 19.2",5.7273405999999998,"+5 43 38.42",9.06,9.01,"B8V            ","B8","V         ",101.5802662,5.7273405999999998,1.9900000000000002]
["16 Mon","","*iC","","",101.63506340000001,"6 46 32.4",8.5871563099999992,"+8 35 13.76",5.76,5.92,"B2.5V          ","B2","V         ",101.63506340000001,8.5871563099999992,5.08]
["HD 49246","","*  ",null,"",101.94394930999999,"6 47 46.5",6.29698227,"+6 17 49.13",7.85,7.92,"B9V            ","B9","V         ",101.94394930999999,6.29698227,3.08]
["HD 49330","","Be*","","Be",101.98861655,"6 47 57.2",0.77611534999999998,"+0 46 34.01",9.14,8.9499999999999993,"B0.5IVe        ","B0","IVe       ",101.98861655,0.77611534999999998,2.0500000000000007]
["V715 Mon","Var","LP*","","",102.26523443000001,"6 49 3.6",1.0020643300000001,"+1 0 7.43",6.0069999999999997,6.1459999999999999,"B3II-III       ","B3","II-III    ",102.26523443000001,1.0020643300000001,4.8540000000000001]
["OV Gem","Var","Ro*",null,"",102.45765192,"6 49 49.8",16.20288772,"+16 12 10.39",5.72,5.87,"B7III          ","B7","III       ",102.45765192,16.20288772,5.13]
["HD 49711","","*  ",null,"",102.52441541,"6 50 5.8",6.2563129399999999,"+6 15 22.72",7.34,7.43,"B8V            ",{"$f":"+LEFT(L1344,2)","v":"B8"},{"$f":"+IF(MID(L1344,3,1)=\".\",MID(L1344,5,10),MID(L1344,3,10))","v":"V         "},102.52441541,6.2563129399999999,3.5700000000000003]
["42 Cam","","*  ",null,"",102.73787086999999,"6 50 57",67.571935330000002,"+67 34 18.96",4.9770000000000003,5.125,"B4IV           ","B4","IV        ",102.73787086999999,67.571935330000002,5.875]
["HD 50085","","*iC",null,"",102.90370297,"6 51 36.8",0.41880771,"+0 25 7.7",8.59,8.66,"B9V            ","B9","V         ",102.90370297,0.41880771,{"$f":"11-K1346","v":2.34}]
["HD 50087","","*iC",null,"",102.91916628,"6 51 40.5",0.32676485999999999,"+0 19 36.35",9.1199999999999992,9.08,"B8III          ","B8","III       ",{"$f":"+F1347","v":102.91916628},{"$f":"+H1347","v":0.32676485999999999},1.92]
["HD 50086","","*  ",null,"",102.92059709999999,"6 51 40.9",0.36968810000000002,"+0 22 10.87",8.1780000000000008,8.2100000000000009,"B8III          ","B8","III       ",102.92059709999999,0.36968810000000002,2.7899999999999991]
["BD+00 1658","","*i*",null,"",102.9394008,"6 51 45.4",0.4825528,"+0 28 57.19",8.98,9.02,"B8V            ","B8","V         ",102.9394008,0.4825528,1.9800000000000004]
["43 Cam","","*  ",null,"",103.42603268000001,"6 53 42.2",68.888309710000001,"+68 53 17.91",4.9850000000000003,5.0970000000000004,"B7III          ","B7","III       ",103.42603268000001,68.888309710000001,5.9029999999999996]
["HD 50559","","*  ",null,"",103.47724580000001,"6 53 54.5",2.1255467000000001,"+2 7 31.96",9.19,9.19,"B8V            ","B8","V         ",103.47724580000001,2.1255467000000001,1.8100000000000005]
["HD 50868","","Be*","","Be",103.80687,"6 55 13.6",5.4340118000000004,"+5 26 2.44",7.7,7.85,"B2Vne          ","B2","Vne       ",103.80687,5.4340118000000004,3.1500000000000004]
["HD 50767","","*  ","","",103.90498717,"6 55 37.1",24.008030399999999,"+24 0 28.9",7.59,7.75,"B2V            ","B2","V         ",103.90498717,24.008030399999999,3.25]
["HR 2589","","*  ",null,"",104.10763759,"6 56 25.8",9.9565742799999999,"+9 57 23.66",5.8159999999999998,5.9050000000000002,"B8Vn           ","B8","Vn        ",104.10763759,9.9565742799999999,5.0949999999999998]
["HR 2568","","Be*",null,"Be",104.13357464000001,"6 56 32",46.2739963,"+46 16 26.38",5.7629999999999999,5.8410000000000002,"B8IIIe         ","B8","IIIe      ",104.13357464000001,46.2739963,5.1589999999999998]
["HD 51507","","*  ",null,"",104.42111387999999,"6 57 41",1.49130334,"+1 29 28.69",7.89,7.98,"B3V            ","B3","V         ",104.42111387999999,1.49130334,3.0199999999999996]
["HD 51354","","Be*","","Be",104.42875617999999,"6 57 42.9",17.902009880000001,"+17 54 7.23",7.02,7.15,"B3ne           ","B3","ne        ",104.42875617999999,17.902009880000001,3.8499999999999996]
["HD 51587","","*  ",null,"",104.4999021,"6 57 59.9",1.2104336,"+1 12 37.56",8.4600000000000009,8.51,"B8V            ","B8","V         ",104.4999021,1.2104336,2.4900000000000002]
["HD 51502","","*i*","","",104.52746041,"6 58 6.5",14.228695139999999,"+14 13 43.3",7.16,7.27,"B9V            ","B9","V         ",104.52746041,14.228695139999999,3.7300000000000004]
["HR 2613","","*  ",null,"",104.83406081,"6 59 20.1",7.3169676299999997,"+7 19 1.08",6.2220000000000004,6.3319999999999999,"B7III          ","B7","III       ",104.83406081,7.3169676299999997,4.6680000000000001]
["HD 51560","","*i*",null,"",104.86328272999999,"6 59 27.1",37.098180669999998,"+37 5 53.45",7.85,7.89,"B6V            ","B6","V         ",104.86328272999999,37.098180669999998,3.1100000000000003]
["40 Gem","","*  ",null,"",104.86637965,"6 59 27.9",25.914171020000001,"+25 54 51.01",6.2850000000000001,6.3890000000000002,"B8III          ","B8","III       ",104.86637965,25.914171020000001,4.6109999999999998]
["HD 267822","","*  ",null,"",105.372775,"7 1 29.4",29.239358899999999,"+29 14 21.69",9.9499999999999993,9.57,"B9V            ","B9","V         ",105.372775,29.239358899999999,1.4299999999999997]
["HR 2633","","*  ","","",105.48025002,"7 1 55.2",5.5571556099999997,"+5 33 25.76",6.5540000000000003,6.5839999999999996,"B2IV-V         ","B2","IV-V      ",105.48025002,5.5571556099999997,4.4160000000000004]
["HD 293039","","*  ","","",105.61241080000001,"7 2 26.9",0.50028830000000002,"+0 30 1.03",9.48,9.42,"B3III          ","B3","III       ",105.61241080000001,0.50028830000000002,1.58]
["HD 51637","","*  ",null,"",105.68121253,"7 2 43.4",63.946605390000002,"+63 56 47.77",9.07,8.98,"B9V            ","B9","V         ",105.68121253,63.946605390000002,2.0199999999999996]
["HR 2645","","*  ",null,"",106.28745038,"7 5 8.9",47.775042419999998,"+47 46 30.15",6.319,6.3680000000000003,"B9IIIn         ","B9","IIIn      ",106.28745038,47.775042419999998,4.6319999999999997]
["44 Gem","","*  ",null,"",106.32653916,"7 5 18.3",22.637457529999999,"+22 38 14.84",5.98,6.01,"B8Vn           ","B8","Vn        ",106.32653916,22.637457529999999,4.99]
["HR 2669","","*  ",null,"",106.85365784,"7 7 24.8",28.176696530000001,"+28 10 36.1",6.3849999999999998,6.4580000000000002,"B9V            ","B9","V         ",106.85365784,28.176696530000001,4.5419999999999998]
["HD 55773","","*  ",null,"",108.73617898000001,"7 14 56.6",14.002947880000001,"+14 0 10.61",8.75,8.84,"B9V            ","B9","V         ",108.73617898000001,14.002947880000001,2.16]
["HR 2760","","*  ",null,"",109.32414206999999,"7 17 17.7",6.6809751400000001,"+6 40 51.51",6.524,6.6239999999999997,"B8III          ","B8","III       ",109.32414206999999,6.6809751400000001,4.3760000000000003]
["HD 56538","","*  ",null,"",109.4976879,"7 17 59.4",15.7410497,"+15 44 27.77",7.95,8.0299999999999994,"B6III          ","B6","III       ",109.4976879,15.7410497,2.9700000000000006]
["HD 56714","","*  ",null,"",109.66805540999999,"7 18 40.3",14.36342428,"+14 21 48.32",7.69,7.77,"B9III          ","B9","III       ",109.66805540999999,14.36342428,3.2300000000000004]
["HD 56868","","*  ",null,"",109.854508,"7 19 25",16.104797000000001,"+16 6 17.26",8.9499999999999993,8.92,"B8III          ","B8","III       ",109.854508,16.104797000000001,2.08]
["HD 57109","","*  ",null,"",110.0686633,"7 20 16.4",14.2223772,"+14 13 20.55",9.0399999999999991,9.1199999999999992,"B9V            ","B9","V         ",110.0686633,14.2223772,1.8800000000000008]
["BD+16 1451","","*  ","","",110.1958312,"7 20 46.9",16.4844942,"+16 29 4.17",9.59,9.6199999999999992,"B9III          ","B9","III       ",110.1958312,16.4844942,1.3800000000000008]
["HR 2801","","*  ",null,"",110.51449461999999,"7 22 3.4",0.177122,"+0 10 37.63",5.9050000000000002,5.9740000000000002,"B8III          ","B8","III       ",110.51449461999999,0.177122,5.0259999999999998]
["HR 2783","","*i*",null,"",110.71189247,"7 22 50.8",55.28433484,"+55 17 3.6",6.67,6.72,"B9V            ","B9","V         ",110.71189247,55.28433484,4.28]
["HR 2784","","*  ",null,"",110.71692667000001,"7 22 52",55.281398670000002,"+55 16 53.03",5.69,5.78,"B8V            ","B8","V         ",110.71692667000001,55.281398670000002,5.22]
["HR 2817","","Be*","","Be",111.11520039,"7 24 27.6",15.51719613,"+15 31 1.9",6.2610000000000001,6.4480000000000004,"B2Ve           ","B2","Ve        ",111.11520039,15.51719613,4.5519999999999996]
["HD 57950","","*  ",null,"",111.46652166,"7 25 51.9",48.54776399,"+48 32 51.95",6.71,6.77,"B9IV           ","B9","IV        ",111.46652166,48.54776399,4.2300000000000004]
["HD 58624","","*  ",null,"",111.7623521,"7 27 2.9",16.099439199999999,"+16 5 57.98",9.14,9.2100000000000009,"B8V            ","B8","V         ",111.7623521,16.099439199999999,1.7899999999999991]
["bet CMi","","Be*",null,"Be",111.78767391,"7 27 9",8.2893157599999991,"+8 17 21.53",2.8140000000000001,2.8860000000000001,"B8Ve           ","B8","Ve        ",111.78767391,8.2893157599999991,8.1140000000000008]
["HD 58784","","*  ","","",111.81784402,"7 27 16.2",2.4647209800000001,"+2 27 52.99",8.48,8.56,"B3III          ","B3","III       ",111.81784402,2.4647209800000001,2.4399999999999995]
["HR 2809","","*  ","","",111.85765644,"7 27 25.8",66.331570560000003,"+66 19 53.65",6.4,6.4640000000000004,"B9III          ","B9","III       ",111.85765644,66.331570560000003,4.5359999999999996]
["HR 2858","","*  ",null,"",112.19688837,"7 28 47.2",15.109820340000001,"+15 6 35.35",6.1849999999999996,6.226,"B9IV           ","B9","IV        ",112.19688837,15.109820340000001,4.774]
["HR 2844","","*  ",null,"",112.21450351999999,"7 28 51.4",48.183928780000002,"+48 11 2.14",5.6109999999999998,5.7030000000000003,"B9mnp...       ","B9","mnp...    ",112.21450351999999,48.183928780000002,5.2969999999999997]
["HD 59723","","*  ",null,"",112.92227382,"7 31 41.3",10.07362298,"+10 4 25.04",8.4499999999999993,8.5,"B9V            ","B9","V         ",112.92227382,10.07362298,2.5]
["HD 60000","","*  ",null,"",113.21337459999999,"7 32 51.2",10.5731886,"+10 34 23.47",8.8699999999999992,8.85,"B8V            ","B8","V         ",113.21337459999999,10.5731886,2.1500000000000004]
["HD 61093","","*  ",null,"",114.42333547,"7 37 41.6",1.92839329,"+1 55 42.21",6.85,6.87,"B9V            ","B9","V         ",114.42333547,1.92839329,4.13]
["HD 61680","","*  ",null,"",115.21053142,"7 40 50.5",9.1331188300000008,"+9 7 59.22",8.16,8.18,"B9V            ","B9","V         ",115.21053142,9.1331188300000008,2.8200000000000003]
["HD 61770","","*  ",null,"",115.29106419999999,"7 41 9.8",5.5933605999999996,"+5 35 36.09",7.92,8.0299999999999994,"B8V            ","B8","V         ",115.29106419999999,5.5933605999999996,2.9700000000000006]
["HD 62979","","*  ",null,"",116.68119830000001,"7 46 43.4",3.6306121999999998,"+3 37 50.2",8.2799999999999994,8.3000000000000007,"B9V            ","B9","V         ",116.68119830000001,3.6306121999999998,2.6999999999999993]
["HD 64745","","*  ",null,"",118.94852374,"7 55 47.6",10.44344918,"+10 26 36.41",6.98,7.01,"B9V            ","B9","V         ",118.94852374,10.44344918,3.99]
["HD 65079","","Be*","","Be",119.26664369,"7 57 3.9",2.95084532,"+2 57 3.04",7.62,7.77,"B2Vne...       ","B2","Vne...    ",119.26664369,2.95084532,3.2300000000000004]
["HD 65041","","*  ","","",119.64529555,"7 58 34.8",43.503926749999998,"+43 30 14.13",7.15,7.33,"B2V            ","B2","V         ",119.64529555,43.503926749999998,3.67]
["HR 3158","","*  ",null,"",121.18876198,"8 4 45.3",18.84202019,"+18 50 31.27",6.16,6.21,"B9V            ","B9","V         ",121.18876198,18.84202019,4.79]
["HD 66665                 ",{"$f":"IF(LEFT(A1398,2)=\"V*\",\"var\",\"\")","v":""},"*  ","","",121.19938144,"8 4 47.8",6.1860578000000004," 6 11 9.8",7.58,7.81,"B1V            ","B1","V         ",121.19938144,6.1860578000000004,3.1900000000000004]
["HR 3201","","*  ",null,"",122.81915995,"8 11 16.5",9.8212297199999998,"+9 49 16.42",5.9660000000000002,6.0810000000000004,"B6III          ","B6","III       ",122.81915995,9.8212297199999998,4.9189999999999996]
["HD 68504","","*  ",null,"",123.21114987999999,"8 12 50.6",4.9285188700000004,"+4 55 42.66",7.24,7.24,"B9V            ","B9","V         ",123.21114987999999,4.9285188700000004,3.76]
["BM Cnc","Var","a2*",null,"",123.28694605,"8 13 8.8",29.65653622,"+29 39 23.53",5.5529999999999999,5.6130000000000004,"B9sp...        ","B9","sp...     ",123.28694605,29.65653622,5.3869999999999996]
["HD 68194","","*  ",null,"",123.36569777,"8 13 27.7",48.280815609999998,"+48 16 50.93",6.8010000000000002,6.8239999999999998,"B9V            ","B9","V         ",123.36569777,48.280815609999998,4.1760000000000002]
["HD 68164","","*  ",null,"",123.69605215999999,"8 14 47",62.036639469999997,"+62 2 11.9",8.92,8.7100000000000009,"B9V            ","B9","V         ",123.69605215999999,62.036639469999997,2.2899999999999991]
["HD 69868","","*  ",null,"",124.93190749999999,"8 19 43.6",20.918082439999999,"+20 55 5.09",8.0399999999999991,8.1,"B9V            ","B9","V         ",124.93190749999999,20.918082439999999,2.9000000000000004]
["HR 3361","","*  ",null,"",127.97706019,"8 31 54.4",9.8140981000000007,"+9 48 50.75",6.76,6.83,"B9p...         ","B9","p...      ",127.97706019,9.8140981000000007,4.17]
["eta Hya","Var","bC*","","",130.8061458,"8 43 13.4",3.3986629700000002,"+3 23 55.18",4.0999999999999996,4.3,"B3V            ","B3","V         ",130.8061458,3.3986629700000002,6.7]
["HR 3470","","*  ",null,"",132.20521041000001,"8 48 49.2",66.708082099999999,"+66 42 29.09",6.0880000000000001,6.1920000000000002,"B8V            ","B8","V         ",132.20521041000001,66.708082099999999,4.8079999999999998]
["HIP 43465","","*iC",null,"",132.79908327000001,"8 51 11.7",11.75613989,"+11 45 22.1",9.8800000000000008,9.93,"B8V            ",{"$f":"+LEFT(L1408,2)","v":"B8"},{"$f":"+IF(MID(L1408,3,1)=\".\",MID(L1408,5,10),MID(L1408,3,10))","v":"V         "},132.79908327000001,11.75613989,1.0700000000000003]
["HD 77770","","*  ","","",136.59388211999999,"9 6 22.5",49.611392240000001,"+49 36 41.01",7.298,7.4790000000000001,"B2IV           ","B2","IV        ",136.59388211999999,49.611392240000001,3.5209999999999999]
["kap Cnc","Var","a2*",null,"",136.93671565,"9 7 44.8",10.66819257,"+10 40 5.49",5.1449999999999996,5.2359999999999998,"B8IIImnp       ","B8","IIImnp    ",136.93671565,10.66819257,{"$f":"11-K1410","v":5.7640000000000002}]
["HD 233622","","V* ","","",140.39000301999999,"9 21 33.6",50.09898819,"+50 5 56.35",9.76,9.91,"B2V            ","B2","V         ",{"$f":"+F1411","v":140.39000301999999},{"$f":"+H1411","v":50.09898819},1.0899999999999999]
["HR 3774","","*  ",null,"",144.02815687,"9 36 6.7",74.318805400000002,"+74 19 7.69",6.3609999999999998,6.444,"B9V            ","B9","V         ",144.02815687,74.318805400000002,4.556]
["27 Leo","","*  ",null,"",149.55573154000001,"9 58 13.3",12.4448018,"+12 26 41.28",5.22,5.2569999999999997,"B6IV           ","B6","IV        ",149.55573154000001,12.4448018,5.7430000000000003]
["HD 86274","","*  ",null,"",149.68512851,"9 58 44.4",50.125156740000001,"+50 7 30.56",6.62,6.69,"B9IV           ","B9","IV        ",149.68512851,50.125156740000001,4.3099999999999996]
["EO Leo","Var","LP*","","",150.70395711,"10 2 48.9",21.9492555,"+21 56 57.31",5.484,5.657,"B2.5IV         ","B2","IV        ",150.70395711,21.9492555,5.343]
["REGULUS","","*i*",null,"",152.09296244000001,"10 8 22.3",11.96720878,"+11 58 1.95",1.24,1.4,"B8IVn          ","B8","IVn       ",152.09296244000001,11.96720878,9.6]
["TX UMa","Var","Al*",null,"",161.33542825999999,"10 45 20.5",45.566325480000003,"+45 33 58.77",6.99,6.98,"B8V+G0III-IV   ","B8","V+G0III-IV",161.33542825999999,45.566325480000003,4.0199999999999996]
["CCDM J11347+1648AB","","** ",null,"",173.67704265,"11 34 42.4",16.796915439999999,"+16 47 48.89",5.78,5.94,"B4V            ","B4","V         ",173.67704265,16.796915439999999,5.0599999999999996]
["HR 4493","","*  ",null,"",175.11429314,"11 40 27.4",57.970406349999998,"+57 58 13.46",6.2430000000000003,6.3339999999999996,"B9p...         ","B9","p...      ",175.11429314,57.970406349999998,4.6660000000000004]
["HD 106420","","*  ",null,"",183.59178166999999,"12 14 22",47.048080319999997,"+47 2 53.08",8.07,8.16,"B8V            ","B8","V         ",183.59178166999999,47.048080319999997,2.84]
["kap Dra","","Be*",null,"Be",188.37059686000001,"12 33 28.9",69.788235839999999,"+69 47 17.64",3.766,3.8809999999999998,"B6IIIe         ","B6","IIIe      ",188.37059686000001,69.788235839999999,7.1189999999999998]
["HD 110166","","*  ",null,"",189.98744427,"12 39 56.9",36.998227139999997,"+36 59 53.61",8.64,8.74,"B8V            ","B8","V         ",189.98744427,36.998227139999997,2.2599999999999998]
["14 CVn","","V* ",null,"",196.43514926,"13 5 44.4",35.798899290000001,"+35 47 56.03",5.133,5.1909999999999998,"B9V            ","B9","V         ",196.43514926,35.798899290000001,5.8090000000000002]
["15 CVn","","*i*",null,"",197.42509999999999,"13 9 42",38.533738999999997,"+38 32 1.46",6.16,6.28,"B7III          ","B7","III       ",197.42509999999999,38.533738999999997,4.72]
["CR UMa","Var","a2*",null,"",206.64856914000001,"13 46 35.6",54.432677869999999,"+54 25 57.64",5.6420000000000003,5.6820000000000004,"B9pe...        ","B9","pe...     ",206.64856914000001,54.432677869999999,5.3179999999999996]
["ALCAID","","V* ","","",206.88515734000001,"13 47 32.4",49.313266730000002,"+49 18 47.76",1.7549999999999999,1.8520000000000001,"B3V            ","B3","V         ",206.88515734000001,49.313266730000002,9.1479999999999997]
["HD 121800","","*  ","","",208.8143791,"13 55 15.4",66.116843320000001,"+66 7 0.63",8.92,9.01,"B1.5V          ","B1","V         ",208.8143791,66.116843320000001,1.9900000000000002]
["HD 123471","","*  ",null,"",211.84189437000001,"14 7 22",22.46255876,"+22 27 45.21",9.43,9.26,"B9V            ","B9","V         ",211.84189437000001,22.46255876,1.7400000000000002]
["HD 126138","","V* ",null,"",215.49942419000001,"14 21 59.8",53.521187449999999,"+53 31 16.27",7.43,7.57,"B9V            ","B9","V         ",215.49942419000001,53.521187449999999,3.4299999999999997]
["HR 5475","","*i*",null,"",220.1815326,"14 40 43.5",16.418324779999999,"+16 25 5.96",4.91,4.91,"B9p+...        ","B9","p+...     ",220.1815326,16.418324779999999,6.09]
["HD 130767","","*  ",null,"",222.36961808000001,"14 49 28.7",19.510368320000001,"+19 30 37.32",6.94,6.9,"B9V            ","B9","V         ",222.36961808000001,19.510368320000001,4.0999999999999996]
["BX Boo","Var","a2*",null,"",225.16132597000001,"15 0 38.7",47.277442610000001,"+47 16 38.79",6.2510000000000003,6.3479999999999999,"B9sp...        ","B9","sp...     ",225.16132597000001,47.277442610000001,4.6520000000000001]
["U CrB","Var","Al*",null,"",229.54730216999999,"15 18 11.3",31.647059980000002,"+31 38 49.41",7.79,7.83,"B6V+F8III-IV   ","B6","V+F8III-IV",229.54730216999999,31.647059980000002,3.17]
["50 Boo","","*  ",null,"",230.45239717999999,"15 21 48.5",32.933694590000002,"+32 56 1.3",5.3239999999999998,5.375,"B9Vn           ","B9","Vn        ",230.45239717999999,32.933694590000002,5.625]
["HD 137005","","*  ",null,"",230.86619970000001,"15 23 27.8",7.6456273399999999,"+7 38 44.25",8.89,9,"B9V            ","B9","V         ",230.86619970000001,7.6456273399999999,2]
["HD 137569","","pA*",null,"",231.58674058,"15 26 20.8",14.69342325,"+14 41 36.32",7.86,7.91,"B5III:          ","B5","III:      ",231.58674058,14.69342325,3.09]
["HD 137569","","pA*",null,"",231.58674058,"15 26 20.8",14.69342325,"+14 41 36.32",7.86,7.91,"B5III:          ","B5","III:      ",231.58674058,14.69342325,3.09]
["12 Ser","","*  ",null,"",233.04031272,"15 32 9.6",16.056168360000001,"+16 3 22.2",6.18,6.218,"B9V            ","B9","V         ",233.04031272,16.056168360000001,4.782]
["tet CrB","","Be*",null,"Be",233.2324256,"15 32 55.7",31.35913227,"+31 21 32.87",4.0359999999999996,4.1529999999999996,"B6Vnne         ","B6","Vnne      ",233.2324256,31.35913227,6.8470000000000004]
["HR 5833","","*i*",null,"",234.84254000000001,"15 39 22.2",36.636580000000002,"+36 38 11.68",6,6,"B9V            ","B9","V         ",234.84254000000001,36.636580000000002,5]
["HR 5834","","SB*",null,"",234.84447155000001,"15 39 22.6",36.635816550000001,"+36 38 8.93",4.8710000000000004,4.9790000000000001,"B7V            ","B7","V         ",234.84447155000001,36.635816550000001,6.0209999999999999]
["gam CrB","Var","dS*","","",235.68568963999999,"15 42 44.5",26.295634629999999,"+26 17 44.28",3.84,3.84,"B9IV+...       ","B9","IV+...    ",235.68568963999999,26.295634629999999,7.16]
["BD+26 2722A","","*i*","","",235.68570399999999,"15 42 44.5",26.295632999999999,"+26 17 44.27",4.01,4.04,"B9IV           ","B9","IV        ",235.68570399999999,26.295632999999999,6.96]
["BP Boo","Var","a2*","","",235.71150076000001,"15 42 50.7",52.360903350000001,"+52 21 39.25",5.4409999999999998,5.4850000000000003,"B9p...         ","B9","p...      ",235.71150076000001,52.360903350000001,5.5149999999999997]
["4 Her","","Be*",null,"Be",238.87746734999999,"15 55 30.5",42.566192610000002,"+42 33 58.29",5.64,5.74,"B9pe           ","B9","pe        ",238.87746734999999,42.566192610000002,5.26]
["HR 5931","","*  ",null,"",238.91605612999999,"15 55 39.8",18.620742329999999,"+18 37 14.67",6.165,6.2519999999999998,"B8III          ","B8","III       ",238.91605612999999,18.620742329999999,4.7480000000000002]
["BD+03 3104B","","*i*",null,"",239.31032880999999,"15 57 14.4",3.4076819399999998,"+3 24 27.65",9.33,8.9,"B6V            ","B6","V         ",239.31032880999999,3.4076819399999998,2.0999999999999996]
["ups Her","","*  ",null,"",240.69957352,"16 2 47.8",46.036704759999999,"+46 2 12.13",4.6280000000000001,4.7140000000000004,"B9III          ","B9","III       ",240.69957352,46.036704759999999,6.2859999999999996]
["phi Her","Var","a2*",null,"",242.19240603,"16 8 46.1",44.934907320000001,"+44 56 5.66",4.1859999999999999,4.2320000000000002,"B9VspHgMn      ","B9","VspHgMn   ",242.19240603,44.934907320000001,6.7679999999999998]
["19 UMi","","*  ",null,"",242.70635196000001,"16 10 49.5",75.877562490000003,"+75 52 39.22",5.3780000000000001,5.4710000000000001,"B8V            ","B8","V         ",242.70635196000001,75.877562490000003,5.5289999999999999]
["CCDM J16197+4619AB","","** ",null,"",244.93515274999999,"16 19 44.4",46.313364530000001,"+46 18 48.11",3.75,3.9,"B5IV            ","B5","IV        ",244.93515274999999,46.313364530000001,7.1]
["CCDM J16197+4619AB","","** ",null,"",244.93515274999999,"16 19 44.4",46.313364530000001,"+46 18 48.11",3.75,3.9,"B5IV            ","B5","IV        ",244.93515274999999,46.313364530000001,7.1]
["ome Her","Var","a2*","","",246.35397603999999,"16 25 24.9",14.033269750000001,"+14 1 59.77",4.5869999999999997,4.5739999999999998,"B9p...         ","B9","p...      ",246.35397603999999,14.033269750000001,6.4260000000000002]
["sig Her","","*  ",null,"",248.52576389999999,"16 34 6.1",42.437040420000002,"+42 26 13.34",4.1870000000000003,4.2,"B9V            ","B9","V         ",248.52576389999999,42.437040420000002,6.8]
["HR 6185","","*i*",null,"",249.05582999999999,"16 36 13.3",52.92389,"+52 55 26",5.03,5.08,"B9V            ","B9","V         ",249.05582999999999,52.92389,5.92]
["17 Dra","","*  ",null,"",249.05716670999999,"16 36 13.7",52.924419440000001,"+52 55 27.9",5.6,5.5,"B9V            ","B9","V         ",249.05716670999999,52.924419440000001,5.5]
["V773 Her","Var","a2*",null,"",249.17891757000001,"16 36 42.9",15.49745611,"+15 29 50.84",6.3049999999999997,6.36,"B9sp...        ","B9","sp...     ",249.17891757000001,15.49745611,4.6399999999999997]
["V600 Her","Var","Ce*","","",249.24251831999999,"16 36 58.2",14.47525373,"+14 28 30.91",6.8390000000000004,7.0090000000000003,"B0.5III        ","B0","III       ",249.24251831999999,14.47525373,3.9909999999999997]
["HD 151067","","*  ",null,"",250.2762262,"16 41 6.2",62.307991000000001,"+62 18 28.76",7.32,7.19,"B8V            ","B8","V         ",250.2762262,62.307991000000001,3.8099999999999996]
["V776 Her","Var","a2*",null,"",251.94341331999999,"16 47 46.4",5.2467443899999999,"+5 14 48.27",5.2140000000000004,5.22,"B9p...         ","B9","p...      ",251.94341331999999,5.2467443899999999,5.78]
["iot Oph","","*  ",null,"",253.50196463,"16 54 0.4",10.16536062,"+10 9 55.29",4.3,4.38,"B8V            ","B8","V         ",253.50196463,10.16536062,6.62]
["V451 Her","Var","a2*",null,"",255.38771319,"17 1 33",14.949716889999999,"+14 56 58.98",6.3159999999999998,6.2789999999999999,"B9p...         ","B9","p...      ",255.38771319,14.949716889999999,4.7210000000000001]
["zet Dra","","*  ",null,"",257.19664984000002,"17 8 47.1",65.714684270000006,"+65 42 52.86",3.0710000000000002,3.1739999999999999,"B6III          ","B6","III       ",257.19664984000002,65.714684270000006,7.8260000000000005]
["HR 6395","","*  ",null,"",257.62762931999998,"17 10 30.6",52.408769290000002,"+52 24 31.56",6.2729999999999997,6.2990000000000004,"B9V            ","B9","V         ",257.62762931999998,52.408769290000002,4.7009999999999996]
["HD 156110","","*  ","","",258.36550197999998,"17 13 27.7",45.372239839999999,"+45 22 20.06",7.42,7.58,"B3Vn           ","B3","Vn        ",258.36550197999998,45.372239839999999,3.42]
["U Oph","Var","Al*",null,"",259.13215193000002,"17 16 31.7",1.2105449100000001,"+1 12 37.96",5.9240000000000004,5.9029999999999996,"B5Vnn+...       ","B5","Vnn+...   ",259.13215193000002,1.2105449100000001,5.0970000000000004]
["U Oph","Var","Al*",null,"",259.13215193000002,"17 16 31.7",1.2105449100000001,"+1 12 37.96",5.9240000000000004,5.9029999999999996,"B5Vnn+...       ","B5","Vnn+...   ",259.13215193000002,1.2105449100000001,5.0970000000000004]
["u Her","Var","Al*","","",259.33153152,"17 17 19.5",33.100100859999998,"+33 6 0.36",4.63,4.8,"B1.5Vp+...     ","B1","Vp+...    ",259.33153152,33.100100859999998,6.2]
["HR 6482","","*  ",null,"",261.14083505999997,"17 24 33.8",15.606046040000001,"+15 36 21.76",6.3550000000000004,6.383,"B9V            ","B9","V         ",261.14083505999997,15.606046040000001,4.617]
["HR 6502","","*  ",null,"",261.70470003999998,"17 26 49.1",20.080977600000001,"+20 4 51.51",5.391,5.51,"B5V             ","B5","V         ",261.70470003999998,20.080977600000001,5.49]
["HR 6502","","*  ",null,"",261.70470003999998,"17 26 49.1",20.080977600000001,"+20 4 51.51",5.391,5.51,"B5V             ","B5","V         ",261.70470003999998,20.080977600000001,5.49]
["HD 160140","","*  ",null,"",264.50230470999998,"17 38 0.5",6.4832618000000002,"+6 28 59.74",7.67,7.74,"B8V            ",{"$f":"+LEFT(L1472,2)","v":"B8"},{"$f":"+IF(MID(L1472,3,1)=\".\",MID(L1472,5,10),MID(L1472,3,10))","v":"V         "},264.50230470999998,6.4832618000000002,3.26]
["HD 160233                ",{"$f":"IF(LEFT(A1473,2)=\"V*\",\"var\",\"\")","v":""},"*  ","","",264.66931928000002,"17 38 40.6",4.3360539899999999," 4 20 9.79",9,9.0399999999999991,"B1V            ","B1","V         ",264.66931928000002,4.3360539899999999,1.9600000000000009]
["iot Her","Var","bC*","","",264.86619202999998,"17 39 27.8",46.006333359999999,"+46 0 22.8",3.63,3.8,"B3IV           ","B3","IV        ",264.86619202999998,46.006333359999999,{"$f":"11-K1474","v":7.2}]
["HD 162094","","*i*","","",266.96690792999999,"17 47 52",34.27787309,"+34 16 40.34",6.46,6.6,"B3V            ","B3","V         ",{"$f":"+F1475","v":266.96690792999999},{"$f":"+H1475","v":34.27787309},4.4000000000000004]
["HD 162365","","*  ","","",267.53172769999998,"17 50 7.6",15.495363190000001,"+15 29 43.3",7.9,8.02,"B2IV           ","B2","IV        ",267.53172769999998,15.495363190000001,2.9800000000000004]
["HD 163442","","*  ",null,"",269.00492028000002,"17 56 1.1",5.16145853,"+5 9 41.25",7.33,7.38,"B8V            ","B8","V         ",269.00492028000002,5.16145853,3.62]
["V2052 Oph","Var","bC*","","",269.07666791999998,"17 56 18.4",0.67035420999999995,"+0 40 13.27",5.883,5.8339999999999996,"B2IV-V         ","B2","IV-V      ",269.07666791999998,0.67035420999999995,5.1660000000000004]
["HD 163592","","*  ",null,"",269.19647040000001,"17 56 47.1",4.376995,"+4 22 37.18",8.1300000000000008,8.02,"B9V            ","B9","V         ",269.19647040000001,4.376995,2.9800000000000004]
["HD 163591","","*  ",null,"",269.19858579999999,"17 56 47.6",4.8366422,"+4 50 11.91",9.02,9.0500000000000007,"B9V            ","B9","V         ",269.19858579999999,4.8366422,1.9499999999999993]
["HR 6690","","*  ",null,"",269.23323110000001,"17 56 55.9",6.4877291399999999,"+6 29 15.82",6.2670000000000003,6.2850000000000001,"B9III          ","B9","III       ",269.23323110000001,6.4877291399999999,4.7149999999999999]
["HD 163774","","*i*",null,"",269.43303750000001,"17 57 43.9",4.4398942000000003,"+4 26 23.61",8.84,8.83,"B9V            ","B9","V         ",269.43303750000001,4.4398942000000003,2.17]
["HD 163862","","*  ",null,"",269.56562657000001,"17 58 15.7",3.92848789,"+3 55 42.55",9.01,9,"B8V            ","B8","V         ",269.56562657000001,3.92848789,2]
["V771 Her","Var","a2*",null,"",269.71793994000001,"17 58 52.3",45.476221789999997,"+45 28 34.39",6.4169999999999998,6.4809999999999999,"B9sp...        ","B9","sp...     ",269.71793994000001,45.476221789999997,4.5190000000000001]
["66 Oph","","Be*","","Be",270.06582602999998,"18 0 15.7",4.3686156399999998,"+4 22 7.01",4.6840000000000002,4.7839999999999998,"B2Ve           ","B2","Ve        ",270.06582602999998,4.3686156399999998,6.2160000000000002]
["HR 6720","","Be*",null,"Be",270.11523862000001,"18 0 27.6",19.505785110000001,"+19 30 20.82",6.37,6.43,"B8Vne          ","B8","Vne       ",270.11523862000001,19.505785110000001,4.57]
["BD+02 3459","","*i*","","",270.17048299999999,"18 0 40.9",2.9195690000000001,"+2 55 10.44",8.1199999999999992,8.1199999999999992,"B2V            ","B2","V         ",270.17048299999999,2.9195690000000001,2.8800000000000008]
["HD 164352","","*  ",null,"",270.1740375,"18 0 41.7",3.1493074999999999,"+3 8 57.5",9.34,9.4,"B8V            ","B8","V         ",270.1740375,3.1493074999999999,1.5999999999999996]
["HR 6719","","*  ","","",270.22024248999998,"18 0 52.8",6.2682935899999999,"+6 16 5.85",6.2389999999999999,6.3410000000000002,"B2IV           ","B2","IV        ",270.22024248999998,6.2682935899999999,4.6589999999999998]
["96 Her","","*  ","","",270.59603443999998,"18 2 23",20.8336313,"+20 50 1.07",5.149,5.2460000000000004,"B3IV           ","B3","IV        ",270.59603443999998,20.8336313,5.7539999999999996]
["97 Her","","*  ",null,"",270.62564142999997,"18 2 30.1",22.923227399999998,"+22 55 23.61",6.117,6.2080000000000002,"B3Vn           ","B3","Vn        ",270.62564142999997,22.923227399999998,4.7919999999999998]
["V986 Oph","Var","bC*","","",271.15565384000001,"18 4 37.3",1.9189917000000001,"+1 55 8.37",6.093,6.15,"B0IIIn         ","B0","IIIn      ",271.15565384000001,1.9189917000000001,4.8499999999999996]
["102 Her","","*i*","","",272.18954758000001,"18 8 45.4",20.814557740000001,"+20 48 52.4",4.1909999999999998,4.3550000000000004,"B2IV           ","B2","IV        ",272.18954758000001,20.814557740000001,6.6449999999999996]
["HD 166331                ",{"$f":"IF(LEFT(A1494,2)=\"V*\",\"var\",\"\")","v":""},"*  ","","",272.46005695000002,"18 9 50.4",10.77402193," 10 46 26.47",9.34,9.39,"B1V            ","B1","V         ",272.46005695000002,10.77402193,1.6099999999999994]
["CCDM J18101+1629AB","","** ",null,"",272.53636635999999,"18 10 8.7",16.476584989999999,"+16 28 35.7",6.68,6.1,"B9V+...        ","B9","V+...     ",272.53636635999999,16.476584989999999,4.9000000000000004]
["HR 6826","","*  ",null,"",273.27007937000002,"18 13 4.8",38.773492269999998,"+38 46 24.57",5.9779999999999998,6.0359999999999996,"B9IIIn         ","B9","IIIn      ",273.27007937000002,38.773492269999998,4.9640000000000004]
["HR 6845","","*  ",null,"",273.91157111000001,"18 15 38.7",42.159344509999997,"+42 9 33.64",5.4409999999999998,5.5579999999999998,"B7IV           ","B7","IV        ",273.91157111000001,42.159344509999997,5.4420000000000002]
["HD 167785","","*  ","","",274.09251383999998,"18 16 22.2",10.814807800000001,"+10 48 53.3",7.48,7.57,"B2V            ","B2","V         ",274.09251383999998,10.814807800000001,3.4299999999999997]
["HR 6851","","*  ",null,"",274.51226199000001,"18 18 2.9",13.777037440000001,"+13 46 37.33",6.2530000000000001,6.2930000000000001,"B5V             ","B5","V         ",274.51226199000001,13.777037440000001,4.7069999999999999]
["HR 6851","","*  ",null,"",274.51226199000001,"18 18 2.9",13.777037440000001,"+13 46 37.33",6.2530000000000001,6.2930000000000001,"B5V             ","B5","V         ",274.51226199000001,13.777037440000001,4.7069999999999999]
["HR 6852","","*  ",null,"",274.53213830999999,"18 18 7.7",18.13169018,"+18 7 54.08",6.22,6.23,"B9V            ","B9","V         ",274.53213830999999,18.13169018,4.7699999999999996]
["V988 Her","Var","bL*",null,"",275.07577316999999,"18 20 18.1",21.073591449999999,"+21 4 24.92",7.75,7.75,"B9V            ","B9","V         ",275.07577316999999,21.073591449999999,3.25]
["HD 168795","","*i*",null,"",275.16111187000001,"18 20 38.6",22.797414750000002,"+22 47 50.69",6.77,6.85,"B8V            ","B8","V         ",275.16111187000001,22.797414750000002,4.1500000000000004]
["HD 168852","","*  ",null,"",275.27568310999999,"18 21 6.1",20.934850350000001,"+20 56 5.46",7.52,7.48,"B9V            ","B9","V         ",275.27568310999999,20.934850350000001,3.5199999999999996]
["HD 168957","","Be*","","Be",275.36570639000001,"18 21 27.7",25.05677798,"+25 3 24.4",6.8940000000000001,6.9829999999999997,"B3V            ","B3","V         ",275.36570639000001,25.05677798,4.0170000000000003]
["HR 6873","","Be*","","Be",275.36834286999999,"18 21 28.4",5.4357200700000003,"+5 26 8.59",6.0990000000000002,6.1470000000000002,"B3Ve           ","B3","Ve        ",275.36834286999999,5.4357200700000003,4.8529999999999998]
["V989 Her","Var","LP*",null,"",275.45185450999998,"18 21 48.4",21.50777209,"+21 30 27.97",6.8,6.89,"B8V            ","B8","V         ",275.45185450999998,21.50777209,4.1100000000000003]
["HR 6900","","*  ",null,"",276.28698327000001,"18 25 8.8",5.0845634899999999,"+5 5 4.42",6.7380000000000004,6.7290000000000001,"B9V            ","B9","V         ",276.28698327000001,5.0845634899999999,4.2709999999999999]
["HD 169798","","*  ","","",276.36615118999998,"18 25 27.8",22.706798800000001,"+22 42 24.47",6.6980000000000004,6.7839999999999998,"B2.5IV-V       ","B2","IV-V      ",276.36615118999998,22.706798800000001,4.2160000000000002]
["HR 6906","","*  ",null,"",276.48012376000003,"18 25 55.2",14.96623232,"+14 57 58.43",6.3280000000000003,6.3650000000000002,"B9V            ","B9","V         ",276.48012376000003,14.96623232,4.6349999999999998]
["HD 170028","","*  ","","",276.58182326000002,"18 26 19.6",26.227718809999999,"+26 13 39.78",6.7560000000000002,6.8810000000000002,"B3V            ","B3","V         ",276.58182326000002,26.227718809999999,4.1189999999999998]
["HD 170051","","*  ","","",276.62175440999999,"18 26 29.2",26.461012830000001,"+26 27 39.64",6.9790000000000001,7.08,"B2V            ","B2","V         ",276.62175440999999,26.461012830000001,3.92]
["HR 6924","","*i*","","",276.67053296,"18 26 40.9",26.449216100000001,"+26 26 57.17",6.3869999999999996,6.4930000000000003,"B3V            ","B3","V         ",276.67053296,26.449216100000001,4.5069999999999997]
["ADS 11373 A","","EB*",null,"",276.94119999999998,"18 27 45.8",24.697500000000002,"+24 41 51",null,7.14,"B8V+A0V        ","B8","V+A0V     ",276.94119999999998,24.697500000000002,3.8600000000000003]
["V994 Her","Var","Al*",null,"",276.94122219000002,"18 27 45.8",24.697406990000001,"+24 41 50.66",7.14,7.14,"B9V            ","B9","V         ",276.94122219000002,24.697406990000001,3.8600000000000003]
["HR 6928","","*  ",null,"",276.99488842,"18 27 58.7",6.1941047500000002,"+6 11 38.77",5.6710000000000003,5.7069999999999999,"B8III-IV       ","B8","III-IV    ",276.99488842,6.1941047500000002,5.2930000000000001]
["HR 6943","","*  ",null,"",277.39879303999999,"18 29 35.7",23.86620096,"+23 51 58.32",5.7720000000000002,5.8659999999999997,"B6IV           ","B6","IV        ",277.39879303999999,23.86620096,5.1340000000000003]
["HR 6941","","*i*","","",277.52133285999997,"18 30 5.1",4.0653517399999997,"+4 3 55.26",6.7530000000000001,6.6849999999999996,"B2V            ","B2","V         ",277.52133285999997,4.0653517399999997,4.3150000000000004]
["HD 170634","","*iN",null,"",277.60365249,"18 30 24.8",1.2232346300000001,"+1 13 23.64",10.38,9.82,"B7V            ","B7","V         ",277.60365249,1.2232346300000001,1.1799999999999997]
["HR 6968","","*i*",null,"",278.20815689,"18 32 49.9",30.554208540000001,"+30 33 15.15",5.3890000000000002,5.4649999999999999,"B8IV           ","B8","IV        ",278.20815689,30.554208540000001,5.5350000000000001]
["HR 6971","","Be*",null,"Be",278.34599402999999,"18 33 23",30.892090169999999,"+30 53 31.52",6.4370000000000003,6.5380000000000003,"B4Ve           ","B4","Ve        ",278.34599402999999,30.892090169999999,4.4619999999999997]
["V2393 Oph","Var","a2*",null,"",278.34709525,"18 33 23.3",8.2682507399999992,"+8 16 5.7",6.3819999999999997,6.4219999999999997,"B8IIIsp...     ","B8","IIIsp...  ",278.34709525,8.2682507399999992,4.5780000000000003]
["HD 171871","","*  ","","",278.59964187999998,"18 34 23.9",51.113156119999999,"+51 6 47.36",7.6,7.78,"B2IIp          ","B2","IIp       ",278.59964187999998,51.113156119999999,3.2199999999999998]
["HR 6984","","*  ",null,"",278.80627164999999,"18 35 13.5",34.458022110000002,"+34 27 28.87",5.984,6.0880000000000001,"B5Vne           ","B5","Vne       ",278.80627164999999,34.458022110000002,4.9119999999999999]
["HR 6984","","*  ",null,"",278.80627164999999,"18 35 13.5",34.458022110000002,"+34 27 28.87",5.984,6.0880000000000001,"B5Vne           ","B5","Vne       ",278.80627164999999,34.458022110000002,4.9119999999999999]
["HR 6997","","*  ",null,"",279.15559915,"18 36 37.3",33.469039690000002,"+33 28 8.54",5.3120000000000003,5.41,"B8II-IIIp...   ","B8","II-IIIp...",279.15559915,33.469039690000002,5.59]
["HR 6992","","*  ",null,"",279.30257846000001,"18 37 12.6",11.421507630000001,"+11 25 17.42",6.54,6.56,"B9V            ","B9","V         ",279.30257846000001,11.421507630000001,4.4400000000000004]
["HR 7017","","*  ",null,"",279.88765189999998,"18 39 33",40.935060219999997,"+40 56 6.21",6.18,6.234,"B9V            ","B9","V         ",279.88765189999998,40.935060219999997,4.766]
["HR 7030","","*  ",null,"",280.42213013000003,"18 41 41.3",31.617611499999999,"+31 37 3.4",6.3559999999999999,6.4029999999999996,"B8V            ","B8","V         ",280.42213013000003,31.617611499999999,4.5970000000000004]
["HR 7033","","*  ",null,"",280.53369663000001,"18 42 8",34.746305270000001,"+34 44 46.69",6.34,6.47,"B5V             ","B5","V         ",280.53369663000001,34.746305270000001,4.53]
["HR 7033","","*  ",null,"",280.53369663000001,"18 42 8",34.746305270000001,"+34 44 46.69",6.34,6.47,"B5V             ","B5","V         ",280.53369663000001,34.746305270000001,4.53]
["4 Aql","","Be*",null,"Be",281.20807582999998,"18 44 49.9",2.06003779,"+2 3 36.13",4.9640000000000004,5.0140000000000002,"B9V            ","B9","V         ",281.20807582999998,2.06003779,5.9859999999999998]
["HD 173528","","*  ","","",281.37190170000002,"18 45 29.2",7.3722291999999996,"+7 22 20.02",10.17,9.91,"B9V            ","B9","V         ",281.37190170000002,7.3722291999999996,1.0899999999999999]
["V535 Her","Var","a2*",null,"",281.39840895999998,"18 45 35.6",21.984681599999998,"+21 59 4.85",6.5339999999999998,6.5229999999999997,"B9p...         ","B9","p...      ",281.39840895999998,21.984681599999998,4.4770000000000003]
["HR 7073","","*  ",null,"",281.55420493000003,"18 46 13",41.441811780000002,"+41 26 30.52",5.9359999999999999,6.0549999999999997,"B6V            ","B6","V         ",281.55420493000003,41.441811780000002,4.9450000000000003]
["HR 7084","","Be*","","Be",281.67953535999999,"18 46 43",52.987961869999999,"+52 59 16.66",5.8,5.9,"B2.5Ve         ",{"$f":"+LEFT(L1536,2)","v":"B2"},{"$f":"+IF(MID(L1536,3,1)=\".\",MID(L1536,5,10),MID(L1536,3,10))","v":"Ve        "},281.67953535999999,52.987961869999999,5.0999999999999996]
["HR 7081","","Be*","","Be",281.98905692,"18 47 57.3",31.756834820000002,"+31 45 24.6",5.9119999999999999,6.0469999999999997,"B3IVp          ","B3","IVp       ",281.98905692,31.756834820000002,4.9530000000000003]
["HD 174105","","Be*",null,"Be",282.09437800000001,"18 48 22.6",15.394135070000001,"+15 23 38.88",6.95,6.93,"B6IV-Ve        ","B6","IV-Ve     ",282.09437800000001,15.394135070000001,{"$f":"11-K1538","v":4.07}]
["HD 174298","","*  ","","",282.23178374000003,"18 48 55.6",24.055870259999999,"+24 3 21.13",6.4640000000000004,6.5339999999999998,"B1.5IV         ","B1","IV        ",{"$f":"+F1539","v":282.23178374000003},{"$f":"+H1539","v":24.055870259999999},4.4660000000000002]
["HD 174391","","*  ","","",282.42697199999998,"18 49 42.4",15.934546559999999,"+15 56 4.36",6.641,6.6710000000000003,"B3V            ","B3","V         ",282.42697199999998,15.934546559999999,4.3289999999999997]
["8 Lyr","","V* ",null,"",282.44130963999999,"18 49 45.9",32.812823780000002,"+32 48 46.16",5.7629999999999999,5.9139999999999997,"B3IV           ","B3","IV        ",282.44130963999999,32.812823780000002,5.0860000000000003]
["bet Lyr","Var","bL*",null,"",282.51998020000002,"18 50 4.7",33.362669439999998,"+33 21 45.6",3.52,3.52,"B8II-IIIep     ","B8","II-IIIep  ",282.51998020000002,33.362669439999998,7.48]
["HD 174664","","SB*",null,"",282.52793869999999,"18 50 6.7",33.351855,"+33 21 6.67",7.05,7.13,"B5V             ","B5","V         ",282.52793869999999,33.351855,3.87]
["HD 174664","","SB*",null,"",282.52793869999999,"18 50 6.7",33.351855,"+33 21 6.67",7.05,7.13,"B5V             ","B5","V         ",282.52793869999999,33.351855,3.87]
["HD 174571","","Be*","","Be",282.69656507000002,"18 50 47.1",8.7028041399999996,"+8 42 10.09",9.35,8.89,"B3V:pe         ","B3","V:pe      ",282.69656507000002,8.7028041399999996,2.1099999999999994]
["HS Her","Var","Al*",null,"",282.70737858000001,"18 50 49.7",24.719982609999999,"+24 43 11.93",8.58,8.56,"B6III          ","B6","III       ",282.70737858000001,24.719982609999999,2.4399999999999995]
["HR 7115","","*  ",null,"",282.90215296000002,"18 51 36.5",36.539088919999998,"+36 32 20.72",5.9930000000000003,6.09,"B6IV           ","B6","IV        ",282.90215296000002,36.539088919999998,4.91]
["HD 175081","","*i*",null,"",283.00626044000001,"18 52 1.5",37.516525209999998,"+37 30 59.49",7.27,7.34,"B5n             ","B5","n         ",283.00626044000001,37.516525209999998,3.66]
["HD 175081","","*i*",null,"",283.00626044000001,"18 52 1.5",37.516525209999998,"+37 30 59.49",7.27,7.34,"B5n             ","B5","n         ",283.00626044000001,37.516525209999998,3.66]
["CCDM J18520+1358AB","","** ",null,"",283.00801066999998,"18 52 1.9",13.965650119999999,"+13 57 56.34",6.2,6.2,"B8Vnn          ","B8","Vnn       ",283.00801066999998,13.965650119999999,4.8]
["HR 7118","","*  ","","",283.03020837999998,"18 52 7.2",41.383244240000003,"+41 22 59.67",6.19,6.2720000000000002,"B9sp...        ","B9","sp...     ",283.03020837999998,41.383244240000003,4.7279999999999998]
["112 Her","","SB*","","",283.06845006999998,"18 52 16.4",21.425142149999999,"+21 25 30.51",5.319,5.4,"B9II-IIIp...   ","B9","II-IIIp...",283.06845006999998,21.425142149999999,5.6]
["BD+48 2781","","*  ","","",283.11983586000002,"18 52 28.7",48.403911049999998,"+48 24 14.07",9.65,9.84,"B2.5V          ","B2","V         ",283.11983586000002,48.403911049999998,1.1600000000000001]
["DI Her","Var","Al*",null,"",283.35933236,"18 53 26.2",24.277997330000002,"+24 16 40.79",8.4600000000000009,8.4700000000000006,"B5III...        ","B5","III...    ",283.35933236,24.277997330000002,2.5299999999999994]
["DI Her","Var","Al*",null,"",283.35933236,"18 53 26.2",24.277997330000002,"+24 16 40.79",8.4600000000000009,8.4700000000000006,"B5III...        ","B5","III...    ",283.35933236,24.277997330000002,2.5299999999999994]
["11 Lyr","","*  ","","",283.43149629999999,"18 53 43.5",36.971719999999998,"+36 58 18.19",5.4329999999999998,5.569,"B2.5V          ","B2","V         ",283.43149629999999,36.971719999999998,5.431]
["HD 175863","","Be*",null,"Be",283.43623669999999,"18 53 44.6",60.017870080000002,"+60 1 4.33",6.9080000000000004,7.0339999999999998,"B4Ve           ","B4","Ve        ",283.43623669999999,60.017870080000002,3.9660000000000002]
["HD 175428","","*  ",null,"",283.70108634000002,"18 54 48.2",15.34267769,"+15 20 33.63",7.07,7.08,"B9V            ","B9","V         ",283.70108634000002,15.34267769,3.92]
["HD 175544","","*  ","","",283.94445430000002,"18 55 46.6",0.26515558,"+0 15 54.56",7.45,7.35,"B2V            ","B2","V         ",283.94445430000002,0.26515558,3.6500000000000004]
["HD 175885","","*i*",null,"",284.00701413000002,"18 56 1.6",33.785589450000003,"+33 47 8.12",8.11,8.1300000000000008,"B9V            ","B9","V         ",284.00701413000002,33.785589450000003,2.8699999999999992]
["V828 Her","Var","a2*",null,"",284.01583378999999,"18 56 3.8",17.9953407,"+17 59 43.22",6.569,6.6390000000000002,"B9sp...        ","B9","sp...     ",284.01583378999999,17.9953407,4.3609999999999998]
["V1665 Aql","Var","Al*",null,"",284.04126589999998,"18 56 9.9",7.9356164199999997,"+7 56 8.21",8.27,8.11,"B9V            ","B9","V         ",284.04126589999998,7.9356164199999997,2.8900000000000006]
["HD 175803","","*  ","","",284.07772485999999,"18 56 18.6",19.847722569999998,"+19 50 51.8",8.0500000000000007,8.0299999999999994,"B3V            ","B3","V         ",284.07772485999999,19.847722569999998,2.9700000000000006]
["64 Ser","","Be*",null,"Be",284.31912416,"18 57 16.5",2.5353475599999999,"+2 32 7.25",5.5620000000000003,5.5629999999999997,"B8IIIe         ","B8","IIIe      ",284.31912416,2.5353475599999999,5.4370000000000003]
["V542 Lyr","Var","Al*",null,"",284.50790827999998,"18 58 1.8",38.266189169999997,"+38 15 58.28",5.798,5.8860000000000001,"B7IV           ","B7","IV        ",284.50790827999998,38.266189169999997,5.1139999999999999]
["HD 176254","","*  ","","",284.67247658000002,"18 58 41.3",20.623167339999998,"+20 37 23.4",6.7569999999999997,6.7409999999999997,"B2IV           ","B2","IV        ",284.67247658000002,20.623167339999998,4.2590000000000003]
["HR 7171","","*  ",null,"",284.68773091000003,"18 58 45",19.794392999999999,"+19 47 39.81",6.4630000000000001,6.5119999999999996,"B7III-IV       ","B7","III-IV    ",284.68773091000003,19.794392999999999,4.4880000000000004]
["V543 Lyr","Var","bC*","","",284.69411865000001,"18 58 46.5",40.679194719999998,"+40 40 45.1",6.04,6.1840000000000002,"B3V            ","B3","V         ",284.69411865000001,40.679194719999998,4.8159999999999998]
["SULAFAT","","*i*",null,"",284.73592673000002,"18 58 56.6",32.689555640000002,"+32 41 22.4",3.2,3.25,"B9III          ","B9","III       ",284.73592673000002,32.689555640000002,7.75]
["V545 Lyr","Var","LP*",null,"",284.80121578000001,"18 59 12.2",39.217322520000003,"+39 13 2.36",6.2489999999999997,6.4039999999999999,"B5IV            ","B5","IV        ",284.80121578000001,39.217322520000003,4.5960000000000001]
["V545 Lyr","Var","LP*",null,"",284.80121578000001,"18 59 12.2",39.217322520000003,"+39 13 2.36",6.2489999999999997,6.4039999999999999,"B5IV            ","B5","IV        ",284.80121578000001,39.217322520000003,4.5960000000000001]
["HR 7173","","*  ","","",284.82225574,"18 59 17.3",10.141003619999999,"+10 8 27.61",7,6.75,"B2Vp           ","B2","Vp        ",284.82225574,10.141003619999999,4.25]
["HD 176258","","*  ",null,"",284.84921580000002,"18 59 23.8",1.4062874999999999,"+1 24 22.63",7.52,7.5,"B9V            ","B9","V         ",284.84921580000002,1.4062874999999999,3.5]
["BD+03 3861","","*  ",null,"",285.0248143,"19 0 5.9",3.31828981,"+3 19 5.84",8.91,8.6300000000000008,"B8V            ","B8","V         ",285.0248143,3.31828981,2.3699999999999992]
["LV Dra","Var","a2*","","",285.05699098000002,"19 0 13.6",50.533465790000001,"+50 32 0.47",5.2030000000000003,5.3710000000000004,"B2.5IV         ","B2","IV        ",285.05699098000002,50.533465790000001,5.6289999999999996]
["HD 176542","","*  ","","",285.06585451000001,"19 0 15.8",15.3470861,"+15 20 49.5",9.0399999999999991,8.8800000000000008,"B2V            ","B2","V         ",285.06585451000001,15.3470861,2.1199999999999992]
["HR 7202","","*  ",null,"",285.32231961000002,"19 1 17.3",26.291410849999998,"+26 17 29.07",5.5979999999999999,5.6829999999999998,"B5V             ","B5","V         ",285.32231961000002,26.291410849999998,5.3170000000000002]
["HR 7202","","*  ",null,"",285.32231961000002,"19 1 17.3",26.291410849999998,"+26 17 29.07",5.5979999999999999,5.6829999999999998,"B5V             ","B5","V         ",285.32231961000002,26.291410849999998,5.3170000000000002]
["HD 176818                ",{"$f":"IF(LEFT(A1579,2)=\"V*\",\"var\",\"\")","v":""},"V* ","","",285.32396576000002,"19 1 17.7",21.513856520000001," 21 30 49.88",7.13,7.0609999999999999,"B1V            ","B1","V         ",285.32396576000002,21.513856520000001,3.9390000000000001]
["HR 7200","","*  ","","",285.34395783999997,"19 1 22.5",20.832841599999998,"+20 49 58.22",6.7759999999999998,6.7770000000000001,"B2IV-V         ","B2","IV-V      ",285.34395783999997,20.832841599999998,4.2229999999999999]
["HR 7212","","*i*",null,"",285.45153727000002,"19 1 48.3",33.621255210000001,"+33 37 16.51",6.2629999999999999,6.3780000000000001,"B5IV            ","B5","IV        ",285.45153727000002,33.621255210000001,4.6219999999999999]
["HR 7212","","*i*",null,"",285.45153727000002,"19 1 48.3",33.621255210000001,"+33 37 16.51",6.2629999999999999,6.3780000000000001,"B5IV            ","B5","IV        ",285.45153727000002,33.621255210000001,4.6219999999999999]
["HD 176873","","** ",null,"",285.45250912,"19 1 48.6",12.540948330000001,"+12 32 27.41",6.9,6.81,"B9V            ","B9","V         ",285.45250912,12.540948330000001,4.1900000000000004]
["BD+02 3771","","*  ","","",286.04052000000001,"19 4 9.7",3.0973397,"+3 5 50.42",9.75,9.26,"B0III          ","B0","III       ",286.04052000000001,3.0973397,1.7400000000000002]
["HD 177648","","Be*","","Be",286.16043394000002,"19 4 38.5",23.329281850000001,"+23 19 45.41",7.32,7.234,"B2Ve           ","B2","Ve        ",286.16043394000002,23.329281850000001,3.766]
["V1441 Aql","Var","bL*","","",286.28560528999998,"19 5 8.5",9.6421304499999998,"+9 38 31.66",7.03,6.88,"B3V            ","B3","V         ",286.28560528999998,9.6421304499999998,4.12]
["HD 178060","","*  ",null,"",286.32269158999998,"19 5 17.4",41.421870920000003,"+41 25 18.73",8.94,8.93,"B9V            ","B9","V         ",286.32269158999998,41.421870920000003,2.0700000000000003]
["V550 Lyr","Var","LP*","","",286.57098350000001,"19 6 17",41.413781610000001,"+41 24 49.61",6.3449999999999998,6.49,"B3V            ","B3","V         ",286.57098350000001,41.413781610000001,4.51]
["HD 178124                ",{"$f":"IF(LEFT(A1589,2)=\"V*\",\"var\",\"\")","v":""},"*  ","","",286.743267,"19 6 58.3",11.442147," 11 26 31.72",9.86,9.4499999999999993,"B1Vnn          ","B1","Vnn       ",286.743267,11.442147,1.5500000000000007]
["18 Aql","","*  ",null,"",286.74417872999999,"19 6 58.6",11.071227029999999,"+11 4 16.41",5.0179999999999998,5.0720000000000001,"B8III          ","B8","III       ",286.74417872999999,11.071227029999999,5.9279999999999999]
["HD 178162","","*  ",null,"",286.79677099000003,"19 7 11.2",8.3490102700000008,"+8 20 56.43",8.92,8.81,"B9V            ","B9","V         ",286.79677099000003,8.3490102700000008,2.1899999999999995]
["iot Lyr","","Be*",null,"Be",286.82553660000002,"19 7 18.1",36.100157039999999,"+36 6 0.56",5.1429999999999998,5.2489999999999997,"B6IV           ","B6","IV        ",286.82553660000002,36.100157039999999,5.7510000000000003]
["GAT 1177","","*  ","","",286.93830000000003,"19 7 45.1",20.768899999999999,"+20 46 8.03",9.6199999999999992,9.4600000000000009,"B9V            ","B9","V         ",286.93830000000003,20.768899999999999,1.5399999999999991]
["HD 178847","","*  ",null,"",287.03474883000001,"19 8 8.3",44.036355469999997,"+44 2 10.87",7.8,7.87,"B9V            ","B9","V         ",287.03474883000001,44.036355469999997,3.13]
["GAT 1178","","*  ",null,"",287.07420000000002,"19 8 17.8",20.689699999999998,"+20 41 22.91",9.9700000000000006,9.81,"B9V            ","B9","V         ",287.07420000000002,20.689699999999998,1.1899999999999995]
["HD 178479","","Be*",null,"Be",287.10488071999998,"19 8 25.1",9.1335464200000001,"+9 8 0.76",9.25,8.93,"B8V            ","B8","V         ",287.10488071999998,9.1335464200000001,2.0700000000000003]
["HD 178849","","*i*","","",287.18832814000001,"19 8 45.1",34.760296740000001,"+34 45 37.06",6.9119999999999999,7.0369999999999999,"B3V            ","B3","V         ",287.18832814000001,34.760296740000001,3.9630000000000001]
["HD 178803","","*  ",null,"",287.40665539999998,"19 9 37.5",11.0682703,"+11 4 5.77",9.44,9.1199999999999992,"B9V            ","B9","V         ",287.40665539999998,11.0682703,1.8800000000000008]
["HD 178774","","Em*","Em","",287.44019348,"19 9 45.6",5.6772354399999996,"+5 40 38.04",8.35,8.08,"B9V            ","B9","V         ",287.44019348,5.6772354399999996,2.92]
["HD 178893","","*  ",null,"",287.50654170000001,"19 10 1.5",10.8948125,"+10 53 41.32",9.8000000000000007,9.35,"B9V            ",{"$f":"+LEFT(L1600,2)","v":"B9"},{"$f":"+IF(MID(L1600,3,1)=\".\",MID(L1600,5,10),MID(L1600,3,10))","v":"V         "},287.50654170000001,10.8948125,1.6500000000000004]
["HD 179124","","*  ",null,"",287.77680086999999,"19 11 6.4",5.2746688199999996,"+5 16 28.8",7.12,7.08,"B9V            ","B9","V         ",287.77680086999999,5.2746688199999996,3.92]
["V471 Lyr","Var","a2*",null,"",287.94170396999999,"19 11 46",31.2834553,"+31 17 0.43",5.8689999999999998,5.931,"B9sp...        ","B9","sp...     ",287.94170396999999,31.2834553,{"$f":"11-K1602","v":5.069}]
["V338 Sge","Var","EB*",null,"",288.14355893999999,"19 12 34.4",16.84641839,"+16 50 47.1",6.72,6.69,"B9IV           ","B9","IV        ",{"$f":"+F1603","v":288.14355893999999},{"$f":"+H1603","v":16.84641839},4.3099999999999996]
["HD 179511","","*  ",null,"",288.1910537,"19 12 45.8",4.7543556000000002,"+4 45 15.68",8.84,8.74,"B9V            ","B9","V         ",288.1910537,4.7543556000000002,2.2599999999999998]
["V1288 Aql","Var","a2*",null,"",288.42793160999997,"19 13 42.7",2.2937056500000002,"+2 17 37.34",5.0670000000000002,5.1369999999999996,"B8II-III       ","B8","II-III    ",288.42793160999997,2.2937056500000002,5.8630000000000004]
["HD 179793","","*  ",null,"",288.43859459999999,"19 13 45.2",4.9868477999999996,"+4 59 12.65",8.82,8.64,"B9V            ","B9","V         ",288.43859459999999,4.9868477999999996,2.3599999999999994]
["eta Lyr","","*  ","","",288.43953468000001,"19 13 45.4",39.145966690000002,"+39 8 45.48",4.2510000000000003,4.3970000000000002,"B2.5IV         ","B2","IV        ",288.43953468000001,39.145966690000002,6.6029999999999998]
["HD 179938","","*  ",null,"",288.53809260999998,"19 14 9.1",10.461257639999999,"+10 27 40.52",8.4499999999999993,8.3699999999999992,"B8V            ","B8","V         ",288.53809260999998,10.461257639999999,2.6300000000000008]
["HD 179968","","*  ","","",288.59151120000001,"19 14 21.9",6.2892333000000002,"+6 17 21.23",9.83,9.57,"B9V            ","B9","V         ",288.59151120000001,6.2892333000000002,1.4299999999999997]
["V1447 Aql","Var","bC*",null,"",288.74210807999998,"19 14 58.1",10.40940202,"+10 24 33.84",7.37,7.38,"B8V            ","B8","V         ",288.74210807999998,10.40940202,3.62]
["HD 180126","","Be*","","Be",288.75597024000001,"19 15 1.4",9.8076157300000002,"+9 48 27.41",8.14,7.99,"B3p            ","B3","p         ",288.75597024000001,9.8076157300000002,3.01]
["HD 231005","","*  ",null,"",288.84266539999999,"19 15 22.2",19.0350839,"+19 2 6.3",9.3079999999999998,9.1069999999999993,"B5V             ","B5","V         ",288.84266539999999,19.0350839,1.8930000000000007]
["HD 231005","","*  ",null,"",288.84266539999999,"19 15 22.2",19.0350839,"+19 2 6.3",9.3079999999999998,9.1069999999999993,"B5V             ","B5","V         ",288.84266539999999,19.0350839,1.8930000000000007]
["HR 7305","","SB*",null,"",288.98734156,"19 15 56.9",27.45592602,"+27 27 21.33",6.48,6.54,"B8V            ","B8","V         ",288.98734156,27.45592602,4.46]
["HD 180398","","Em*","Em","",288.99161865999997,"19 15 57.9",13.10818121,"+13 6 29.45",7.97,7.93,"B8Ve           ","B8","Ve        ",288.99161865999997,13.10818121,3.0700000000000003]
["1 Vul","","*  ",null,"",289.05433207999999,"19 16 13",21.390426080000001,"+21 23 25.53",4.6879999999999997,4.758,"B4IV           ","B4","IV        ",289.05433207999999,21.390426080000001,6.242]
["HD 181653                ",{"$f":"IF(LEFT(A1617,2)=\"V*\",\"var\",\"\")","v":""},"*  ","","",289.10086465000001,"19 16 24.2",67.135165900000004," 67 8 6.59",7.8,7.97,"B1II-III       ","B1","II-III    ",289.10086465000001,67.135165900000004,3.0300000000000002]
["HD 180715","","*  ","","",289.26458789999998,"19 17 3.5",16.087993300000001,"+16 5 16.77",8.31,8.18,"B9V            ","B9","V         ",289.26458789999998,16.087993300000001,2.8200000000000003]
["HD 180811","","*  ",null,"",289.29656123000001,"19 17 11.1",22.42605528,"+22 25 33.79",8,7.91,"B9V            ","B9","V         ",289.29656123000001,22.42605528,3.09]
["V1449 Aql","Var","bC*","","",289.31167983,"19 17 14.8",1.0594168500000001,"+1 3 33.9",8.4700000000000006,8.2899999999999991,"B1.5II-III     ","B1","II-III    ",289.31167983,1.0594168500000001,2.7100000000000009]
["RS Vul","Var","Al*",null,"",289.41663438,"19 17 39.9",22.441211620000001,"+22 26 28.36",6.91,6.85,"B5V+G0III-IV    ","B5","V+G0III-IV",289.41663438,22.441211620000001,4.1500000000000004]
["RS Vul","Var","Al*",null,"",289.41663438,"19 17 39.9",22.441211620000001,"+22 26 28.36",6.91,6.85,"B5V+G0III-IV    ","B5","V+G0III-IV",289.41663438,22.441211620000001,4.1500000000000004]
["HD 180812","","*  ",null,"",289.42193531999999,"19 17 41.2",10.35206097,"+10 21 7.41",9.31,9,"B9V            ","B9","V         ",289.42193531999999,10.35206097,2]
["ES Vul","Var","bC*","","",289.43181894999998,"19 17 43.6",23.025542340000001,"+23 1 31.95",5.4669999999999996,5.4770000000000003,"B0.5IV         ","B0","IV        ",289.43181894999998,23.025542340000001,5.5229999999999997]
["U Sge","Var","Al*",null,"",289.70170366000002,"19 18 48.4",19.610478409999999,"+19 36 37.72",6.49,6.5,"B7.5V+G4III-IV ","B7","V+G4III-IV",289.70170366000002,19.610478409999999,4.5]
["HR 7335","","*  ","","",289.76558798999997,"19 19 3.7",33.38881147,"+33 23 19.72",6.3869999999999996,6.5730000000000004,"B2IVe          ","B2","IVe       ",289.76558798999997,33.38881147,4.4269999999999996]
["HD 181167","","*  ",null,"",289.77094812000001,"19 19 5",10.04570137,"+10 2 44.52",8.6300000000000008,8.4700000000000006,"B9V            ","B9","V         ",289.77094812000001,10.04570137,2.5299999999999994]
["HD 181360","","*  ","","",289.81720924000001,"19 19 16.1",23.304104379999998,"+23 18 14.77",7.67,7.62,"B3V            ","B3","V         ",289.81720924000001,23.304104379999998,3.38]
["HD 181492","","*  ","","",289.86541963000002,"19 19 27.7",31.96632512,"+31 57 58.77",6.734,6.8209999999999997,"B3V            ","B3","V         ",289.86541963000002,31.96632512,4.1790000000000003]
["HR 7361","","*i*","","",289.94224852999997,"19 19 46.1",64.390807510000002,"+64 23 26.9",6.4189999999999996,6.5149999999999997,"B9mnp...       ","B9","mnp...    ",289.94224852999997,64.390807510000002,4.4850000000000003]
["HR 7346","","*i*",null,"",290.13773142000002,"19 20 33",35.185957449999997,"+35 11 9.44",6.1959999999999997,6.2869999999999999,"B9V            ","B9","V         ",290.13773142000002,35.185957449999997,4.7130000000000001]
["HD 181690","","*  ",null,"",290.35206419999997,"19 21 24.4",8.9069999999999996E-2,"+0 5 20.65",9.18,9.0500000000000007,"B9V            ","B9","V         ",290.35206419999997,8.9069999999999996E-2,1.9499999999999993]
["HD 181963","","*  ","","",290.36619037999998,"19 21 27.8",25.603964820000002,"+25 36 14.27",7.39,7.4340000000000002,"B2V            ","B2","V         ",290.36619037999998,25.603964820000002,3.5659999999999998]
["Z Vul","Var","Al*","","",290.41294102000001,"19 21 39.1",25.574846220000001,"+25 34 29.44",7.4,7.33,"B2V+B9V        ","B2","V+B9V     ",290.41294102000001,25.574846220000001,3.67]
["CCDM J19220+2230AB","","** ","","",290.48858616000001,"19 21 57.2",22.506423009999999,"+22 30 23.12",7.46,7.5,"B2.5V          ","B2","V         ",290.48858616000001,22.506423009999999,3.5]
["HD 182078","","*  ","","",290.55158891999997,"19 22 12.3",22.536262369999999,"+22 32 10.54",7.75,7.8,"B2V            ","B2","V         ",290.55158891999997,22.536262369999999,3.2]
["HD 182146","","*  ",null,"",290.62825208999999,"19 22 30.7",22.18804239,"+22 11 16.95",8.0299999999999994,8.06,"B8V            ","B8","V         ",290.62825208999999,22.18804239,2.9399999999999995]
["HD 231260","","*  ",null,"",290.65973330000003,"19 22 38.3",13.8960644,"+13 53 45.83",9.8979999999999997,9.3070000000000004,"B8V            ","B8","V         ",290.65973330000003,13.8960644,1.6929999999999996]
["V377 Vul","Var","LP*",null,"",290.71202205999998,"19 22 50.8",26.26240817,"+26 15 44.66",5.07,5.19,"B6III          ","B6","III       ",290.71202205999998,26.26240817,5.81]
["HR 7381","","*  ","","",290.84911276999998,"19 23 23.7",50.271288329999997,"+50 16 16.63",6.4329999999999998,6.5140000000000002,"B9III          ","B9","III       ",290.84911276999998,50.271288329999997,4.4859999999999998]
["HD 231285","","*  ","","",290.84970172999999,"19 23 23.9",15.2158914,"+15 12 57.2",10.130000000000001,9.56,"B0III          ","B0","III       ",290.84970172999999,15.2158914,1.4399999999999995]
["HD 182221","","*  ",null,"",290.88631713000001,"19 23 32.7",4.2098676900000003,"+4 12 35.52",9.32,9.0299999999999994,"B9V            ","B9","V         ",290.88631713000001,4.2098676900000003,1.9700000000000006]
["HD 182381","","*  ",null,"",290.96038600000003,"19 23 50.4",16.01413865,"+16 0 50.89",7.7380000000000004,7.6210000000000004,"B9p            ","B9","p         ",290.96038600000003,16.01413865,3.3789999999999996]
["2 Cyg","","*  ","","",291.03157891000001,"19 24 7.5",29.6213388,"+29 37 16.81",4.859,4.976,"B3IV           ","B3","IV        ",291.03157891000001,29.6213388,6.024]
["HD 182489","","*  ",null,"",291.05291758999999,"19 24 12.7",18.74116665,"+18 44 28.19",7.92,7.92,"B8V            ","B8","V         ",291.05291758999999,18.74116665,3.08]
["HR 7374","","*  ",null,"",291.09391462999997,"19 24 22.5",28.087569250000001,"+28 5 15.24",6.4390000000000001,6.5179999999999998,"B5V             ","B5","V         ",291.09391462999997,28.087569250000001,4.4820000000000002]
["HR 7374","","*  ",null,"",291.09391462999997,"19 24 22.5",28.087569250000001,"+28 5 15.24",6.4390000000000001,6.5179999999999998,"B5V             ","B5","V         ",291.09391462999997,28.087569250000001,4.4820000000000002]
["HD 344313","","Be*","","Be",291.19071500000001,"19 24 45.7",22.774632799999999,"+22 46 28.67",9.9499999999999993,9.4499999999999993,"B2V:pe         ","B2","V:pe      ",291.19071500000001,22.774632799999999,1.5500000000000007]
["HD 350000","","*  ",null,"",291.24808167999998,"19 24 59.5",19.799991240000001,"+19 47 59.96",9,8.86,"B9V            ","B9","V         ",291.24808167999998,19.799991240000001,2.1400000000000006]
["HD 231385","","*  ",null,"",291.42927459999999,"19 25 43",19.464528900000001,"+19 27 52.3",9.69,9.5,"B9V            ","B9","V         ",291.42927459999999,19.464528900000001,1.5]
["HR 7401","","*  ",null,"",291.44485731999998,"19 25 46.7",58.02732219,"+58 1 38.35",6.4459999999999997,6.5810000000000004,"B8IVwe...      ","B8","IVwe...   ",291.44485731999998,58.02732219,4.4189999999999996]
["HD 234893","","*  ",null,"",291.48978290000002,"19 25 57.5",50.900934999999997,"+50 54 3.36",9.23,9.33,"B5.5IV-V       ","B5","IV-V      ",291.48978290000002,50.900934999999997,1.67]
["HD 234893","","*  ",null,"",291.48978290000002,"19 25 57.5",50.900934999999997,"+50 54 3.36",9.23,9.33,"B5.5IV-V       ","B5","IV-V      ",291.48978290000002,50.900934999999997,1.67]
["V1741 Cyg","Var","a2*",null,"",291.53803011999997,"19 26 9.1",36.317897879999997,"+36 19 4.43",5.03,5.16,"B9sp...        ","B9","sp...     ",291.53803011999997,36.317897879999997,5.84]
["HD 182918","","*iN",null,"",291.54715879000003,"19 26 11.3",22.757295119999998,"+22 45 26.26",8.75,8.66,"B6V            ","B6","V         ",291.54715879000003,22.757295119999998,2.34]
["HD 231420","","*  ",null,"",291.62207080000002,"19 26 29.2",19.248645,"+19 14 55.12",10.247999999999999,9.76,"B9IIIp         ","B9","IIIp      ",291.62207080000002,19.248645,1.2400000000000002]
["HD 183013","","*  ","","",291.68611614999998,"19 26 44.6",21.65311831,"+21 39 11.22",7.47,7.36,"B2IV           ","B2","IV        ",291.68611614999998,21.65311831,3.6399999999999997]
["HD 183014","","*i*",null,"",291.70157332999997,"19 26 48.3",21.162826849999998,"+21 9 46.17",7.35,7.33,"B7V            ","B7","V         ",291.70157332999997,21.162826849999998,3.67]
["HD 350040","","*  ",null,"",291.8882079,"19 27 33.1",20.154812799999998,"+20 9 17.32",8.99,8.84,"B8V            ","B8","V         ",291.8882079,20.154812799999998,2.16]
["HR 7396","","V* ",null,"",291.89128691000002,"19 27 33.9",14.282481349999999,"+14 16 56.93",6.2389999999999999,6.3070000000000004,"B4III          ","B4","III       ",291.89128691000002,14.282481349999999,4.6929999999999996]
["HR 7403","","Be*","","Be",291.90165131999998,"19 27 36.3",37.941196830000003,"+37 56 28.3",6.1749999999999998,6.2939999999999996,"B3Ve           ","B3","Ve        ",291.90165131999998,37.941196830000003,4.7060000000000004]
["HD 183282","","*  ",null,"",292.00407466000001,"19 28 0.9",21.75407723,"+21 45 14.67",8.6999999999999993,8.64,"B8V            ","B8","V         ",292.00407466000001,21.75407723,2.3599999999999994]
["HR 7397","","*  ",null,"",292.08666261000002,"19 28 20.7",2.9300333799999998,"+2 55 48.12",5.84,5.8470000000000004,"B6III          ","B6","III       ",292.08666261000002,2.9300333799999998,5.1529999999999996]
["HD 183419","","V* ",null,"",292.20198040000002,"19 28 48.4",18.486295599999998,"+18 29 10.66",8.24,8.18,"B6IV           ",{"$f":"+LEFT(L1664,2)","v":"B6"},{"$f":"+IF(MID(L1664,3,1)=\".\",MID(L1664,5,10),MID(L1664,3,10))","v":"IV        "},292.20198040000002,18.486295599999998,2.8200000000000003]
["HD 183459","","*  ",null,"",292.23191839999998,"19 28 55.6",21.624195019999998,"+21 37 27.1",8.4,8.36,"B8V            ","B8","V         ",292.23191839999998,21.624195019999998,2.6400000000000006]
["HD 183561","","*  ","","",292.31104568000001,"19 29 14.6",26.716803429999999,"+26 43 0.49",8.2200000000000006,8.0500000000000007,"B2III          ","B2","III       ",292.31104568000001,26.716803429999999,{"$f":"11-K1666","v":2.9499999999999993}]
["7 Vul","","Be*",null,"Be",292.33707131,"19 29 20.8",20.279739259999999,"+20 16 47.06",6.2309999999999999,6.327,"B5Vn            ","B5","Vn        ",{"$f":"+F1667","v":292.33707131},{"$f":"+H1667","v":20.279739259999999},4.673]
["7 Vul","","Be*",null,"Be",292.33707131,"19 29 20.8",20.279739259999999,"+20 16 47.06",6.2309999999999999,6.327,"B5Vn            ","B5","Vn        ",292.33707131,20.279739259999999,4.673]
["HD 183442","","*  ",null,"",292.37532291000002,"19 29 30",3.0898928899999998,"+3 5 23.61",8.14,8.08,"B5V             ","B5","V         ",292.37532291000002,3.0898928899999998,2.92]
["HD 183442","","*  ",null,"",292.37532291000002,"19 29 30",3.0898928899999998,"+3 5 23.61",8.14,8.08,"B5V             ","B5","V         ",292.37532291000002,3.0898928899999998,2.92]
["HD 183680","","*  ",null,"",292.38302979000002,"19 29 31.9",31.374280070000001,"+31 22 27.4",7.97,8.02,"B9V            ","B9","V         ",292.38302979000002,31.374280070000001,2.9800000000000004]
["HD 231621","","*  ",null,"",292.58878168000001,"19 30 21.3",19.192942729999999,"+19 11 34.59",9.86,9.5,"B5III           ","B5","III       ",292.58878168000001,19.192942729999999,1.5]
["HD 231621","","*  ",null,"",292.58878168000001,"19 30 21.3",19.192942729999999,"+19 11 34.59",9.86,9.5,"B5III           ","B5","III       ",292.58878168000001,19.192942729999999,1.5]
["HR 7415","","Be*",null,"Be",292.63801324999997,"19 30 33.1",3.4444053800000001,"+3 26 39.85",6.0670000000000002,6.0890000000000004,"B6sh           ","B6","sh        ",292.63801324999997,3.4444053800000001,4.9109999999999996]
["CCDM J19307+2758B","","** ",null,"",292.68914763999999,"19 30 45.3",27.9652764,"+27 57 54.99",5.0270000000000001,5.0880000000000001,"B8Ve           ","B8","Ve        ",292.68914763999999,27.9652764,5.9119999999999999]
["HD 183888","","*  ",null,"",292.84153285999997,"19 31 21.9",11.171500719999999,"+11 10 17.4",8.16,8.25,"B8V            ","B8","V         ",292.84153285999997,11.171500719999999,2.75]
["8 Cyg","","*  ",null,"",292.94300765999998,"19 31 46.3",34.452968740000003,"+34 27 10.68",4.5999999999999996,4.72,"B3IV           ","B3","IV        ",292.94300765999998,34.452968740000003,6.28]
["HD 184108","","*  ","","",293.00754903000001,"19 32 1.8",20.929427499999999,"+20 55 45.93",6.9779999999999998,6.9969999999999999,"B9III          ","B9","III       ",293.00754903000001,20.929427499999999,4.0030000000000001]
["HD 184279","","Be*","","Be",293.40383036999998,"19 33 36.9",3.7613273700000001,"+3 45 40.77",6.98,6.98,"B0.5IV         ","B0","IV        ",293.40383036999998,3.7613273700000001,4.0199999999999996]
["HD 184502","","*  ","","",293.57794116999997,"19 34 18.7",16.265000329999999,"+16 15 54",6.9850000000000003,7.0190000000000001,"B3III          ","B3","III       ",293.57794116999997,16.265000329999999,3.9809999999999999]
["HD 344590","","*  ",null,"",293.58874165999998,"19 34 21.2",21.709899969999999,"+21 42 35.63",9.32,9.1999999999999993,"B8V            ","B8","V         ",293.58874165999998,21.709899969999999,1.8000000000000007]
["9 Vul","","V* ",null,"",293.64539872,"19 34 34.8",19.773401710000002,"+19 46 24.24",4.9000000000000004,4.9909999999999997,"B8IIIn         ","B8","IIIn      ",293.64539872,19.773401710000002,6.0090000000000003]
["HD 344669","","*  ",null,"",293.87146250000001,"19 35 29.1",20.887841699999999,"+20 53 16.23",9.07,8.9700000000000006,"B8V            ","B8","V         ",293.87146250000001,20.887841699999999,2.0299999999999994]
["HD 184829","","*  ",null,"",293.88267173000003,"19 35 31.8",20.822003949999999,"+20 49 19.21",8.3000000000000007,8.3000000000000007,"B8V            ","B8","V         ",293.88267173000003,20.822003949999999,2.6999999999999993]
["V1671 Cyg","Var","Ro*","","",293.88337508000001,"19 35 32",31.276648359999999,"+31 16 35.93",7.29,7.44,"B2V            ","B2","V         ",293.88337508000001,31.276648359999999,3.5599999999999996]
["11 Cyg","","Be*",null,"Be",293.95126733000001,"19 35 48.3",36.944540519999997,"+36 56 40.34",5.9489999999999998,6.0279999999999996,"B8Vne          ","B8","Vne       ",293.95126733000001,36.944540519999997,4.9720000000000004]
["HR 7452","","*  ",null,"",294.03480268999999,"19 36 8.3",22.585759459999998,"+22 35 8.73",6.27,6.3209999999999997,"B9sp...        ","B9","sp...     ",294.03480268999999,22.585759459999998,4.6790000000000003]
["BD+29 3660","","Em*","Em","",294.04385079999997,"19 36 10.5",29.821281899999999,"+29 49 16.61",9.15,9.23,"B5V             ","B5","V         ",294.04385079999997,29.821281899999999,1.7699999999999996]
["BD+29 3660","","Em*","Em","",294.04385079999997,"19 36 10.5",29.821281899999999,"+29 49 16.61",9.15,9.23,"B5V             ","B5","V         ",294.04385079999997,29.821281899999999,1.7699999999999996]
["HD 231970","","*  ","","",294.11679670000001,"19 36 28",12.9618292,"+12 57 42.58",9.7899999999999991,9.8000000000000007,"B2V            ","B2","V         ",294.11679670000001,12.9618292,1.1999999999999993]
["V1744 Cyg","Var","a2*",null,"",294.2174728,"19 36 52.1",30.325018440000001,"+30 19 30.06",7.51,7.59,"B9V            ","B9","V         ",294.2174728,30.325018440000001,3.41]
["HR 7467","","*  ",null,"",294.23603958000001,"19 36 56.6",38.3838261,"+38 23 1.77",6.3739999999999997,6.4980000000000002,"B5II-III        ","B5","II-III    ",294.23603958000001,38.3838261,4.5019999999999998]
["HR 7467","","*  ",null,"",294.23603958000001,"19 36 56.6",38.3838261,"+38 23 1.77",6.3739999999999997,6.4980000000000002,"B5II-III        ","B5","II-III    ",294.23603958000001,38.3838261,4.5019999999999998]
["HR 7466","","*  ",null,"",294.29007687000001,"19 37 9.6",29.333699979999999,"+29 20 1.31",6.3440000000000003,6.4470000000000001,"B5V             ","B5","V         ",294.29007687000001,29.333699979999999,4.5529999999999999]
["HR 7466","","*  ",null,"",294.29007687000001,"19 37 9.6",29.333699979999999,"+29 20 1.31",6.3440000000000003,6.4470000000000001,"B5V             ","B5","V         ",294.29007687000001,29.333699979999999,4.5529999999999999]
["HD 185195","","*  ",null,"",294.32433681999998,"19 37 17.8",15.25066853,"+15 15 2.4",8.11,8.07,"B8V            ","B8","V         ",294.32433681999998,15.25066853,2.9299999999999997]
["HD 185418","","*i*","","",294.61450510999998,"19 38 27.4",17.257234579999999,"+17 15 26.04",7.6539999999999999,7.5190000000000001,"B0.5V          ","B0","V         ",294.61450510999998,17.257234579999999,3.4809999999999999]
["HR 7471","","*  ","","",294.70412986000002,"19 38 48.9",3.3815216800000001,"+3 22 53.47",6.3579999999999997,6.3609999999999998,"B3III          ","B3","III       ",294.70412986000002,3.3815216800000001,4.6390000000000002]
["HD 185780","","*  ","","",294.78148141999998,"19 39 7.5",40.62683869,"+40 37 36.61",7.63,7.72,"B0III          ","B0","III       ",294.78148141999998,40.62683869,3.2800000000000002]
["HD 185835","","*  ",null,"",294.79245388999999,"19 39 10.1",43.839502809999999,"+43 50 22.21",7.93,7.97,"B8V            ","B8","V         ",294.79245388999999,43.839502809999999,3.0300000000000002]
["sig Aql","Var","bL*","","",294.79851024999999,"19 39 11.6",5.3977721499999998,"+5 23 51.97",5.1760000000000002,5.1779999999999999,"B3V+...        ","B3","V+...     ",294.79851024999999,5.3977721499999998,5.8220000000000001]
["14 Cyg","","*  ",null,"",294.86035668,"19 39 26.4",42.818280020000003,"+42 49 5.8",5.343,5.4059999999999997,"B9III          ","B9","III       ",294.86035668,42.818280020000003,5.5940000000000003]
["HD 185755","","*  ","","",294.87403674000001,"19 39 29.7",30.408272239999999,"+30 24 29.78",7.0860000000000003,7.1639999999999997,"B9V            ","B9","V         ",294.87403674000001,30.408272239999999,3.8360000000000003]
["HD 185757","","*  ",null,"",294.99459560999998,"19 39 58.7",21.568037650000001,"+21 34 4.93",8.4600000000000009,8.31,"B8V            ","B8","V         ",294.99459560999998,21.568037650000001,2.6899999999999995]
["HD 185803","","*  ",null,"",295.09392357000002,"19 40 22.5",16.33335911,"+16 20 0.09",7.44,7.41,"B8V            ","B8","V         ",295.09392357000002,16.33335911,3.59]
["HR 7485","","*i*",null,"",295.16491349,"19 40 39.5",23.71794963,"+23 43 4.61",6.6379999999999999,6.65,"B6IV           ","B6","IV        ",295.16491349,23.71794963,4.3499999999999996]
["QS Aql","Var","Al*",null,"",295.27303461999998,"19 41 5.5",13.815680609999999,"+13 48 56.45",5.907,5.9880000000000004,"B5V             ","B5","V         ",295.27303461999998,13.815680609999999,5.0119999999999996]
["QS Aql","Var","Al*",null,"",295.27303461999998,"19 41 5.5",13.815680609999999,"+13 48 56.45",5.907,5.9880000000000004,"B5V             ","B5","V         ",295.27303461999998,13.815680609999999,5.0119999999999996]
["HD 332408","","*  ","","",295.53325235,"19 42 7.9",28.99598911,"+28 59 45.56",8.93,8.94,"B2IV           ","B2","IV        ",295.53325235,28.99598911,2.0600000000000005]
["46 Aql","","*  ",null,"",295.55338612000003,"19 42 12.8",12.19326064,"+12 11 35.73",6.2489999999999997,6.3250000000000002,"B9III          ","B9","III       ",295.55338612000003,12.19326064,4.6749999999999998]
["HD 186428","","Pu*",null,"",295.60722504,"19 42 25.7",44.021751960000003,"+44 1 18.3",8.0399999999999991,8.08,"B7III          ","B7","III       ",295.60722504,44.021751960000003,2.92]
["HD 186272","","Be*","","Be",295.70114669999998,"19 42 48.2",17.968267560000001,"+17 58 5.76",7.88,7.78,"B2.5V          ","B2","V         ",295.70114669999998,17.968267560000001,3.2199999999999998]
["HD 344783","","Be*","","Be",295.77829209999999,"19 43 6.7",23.2701122,"+23 16 12.4",10.11,9.8000000000000007,"B0IV           ","B0","IV        ",295.77829209999999,23.2701122,1.1999999999999993]
["HD 186618","","*i*","","",295.84369149999998,"19 43 22.4",47.244711610000003,"+47 14 40.96",7.59,7.75,"B0V            ","B0","V         ",295.84369149999998,47.244711610000003,3.25]
["HD 186412","","*  ",null,"",295.85434287999999,"19 43 25",22.494987609999999,"+22 29 41.95",6.7309999999999999,6.8150000000000004,"B5V             ","B5","V         ",295.85434287999999,22.494987609999999,4.1849999999999996]
["HD 186412","","*  ",null,"",295.85434287999999,"19 43 25",22.494987609999999,"+22 29 41.95",6.7309999999999999,6.8150000000000004,"B5V             ","B5","V         ",295.85434287999999,22.494987609999999,4.1849999999999996]
["HR 7512","","*i*",null,"",295.96438245000002,"19 43 51.4",34.162724519999998,"+34 9 45.8",5.9870000000000001,6.0570000000000004,"B5III           ","B5","III       ",295.96438245000002,34.162724519999998,4.9429999999999996]
["HR 7512","","*i*",null,"",295.96438245000002,"19 43 51.4",34.162724519999998,"+34 9 45.8",5.9870000000000001,6.0570000000000004,"B5III           ","B5","III       ",295.96438245000002,34.162724519999998,4.9429999999999996]
["HR 7508","","*  ",null,"",295.98322631000002,"19 43 55.9",27.135397829999999,"+27 8 7.43",7.3680000000000003,6.3540000000000001,"B7V+...        ","B7","V+...     ",295.98322631000002,27.135397829999999,4.6459999999999999]
["psi Aql","","*  ",null,"",296.14246652999998,"19 44 34.1",13.302783399999999,"+13 18 10.02",6.2080000000000002,6.25,"B9III-IV       ","B9","III-IV    ",296.14246652999998,13.302783399999999,4.75]
["HD 186549","","*  ",null,"",296.19888459999999,"19 44 47.7",10.2042939,"+10 12 15.45",10.09,9.94,"B9V            ","B9","V         ",296.19888459999999,10.2042939,1.0600000000000005]
["BD+10 4036C","","*i*",null,"",296.23500000000001,"19 44 56.4",10.7753,"+10 46 31.07",null,9.5,"B4n            ","B4","n         ",296.23500000000001,10.7753,1.5]
["CCDM J19449+1047AB","","** ","","",296.23636699999997,"19 44 56.7",10.775294000000001,"+10 46 31.05",7.61,7.5,"B2V            ","B2","V         ",296.23636699999997,10.775294000000001,3.5]
["BD+23 3758               ",{"$f":"IF(LEFT(A1724,2)=\"V*\",\"var\",\"\")","v":""},"*iA","","",296.27533,"19 45 6",23.976859999999999," 23 58 36.69",10.69,9.99,"B1V            ","B1","V         ",296.27533,23.976859999999999,1.0099999999999998]
["HD 186994","","*  ","","",296.40820517999998,"19 45 37.9",44.963742590000003,"+44 57 49.47",7.39,7.51,"B0III          ","B0","III       ",296.40820517999998,44.963742590000003,3.49]
["HD 344880","","*iA","","",296.42630869999999,"19 45 42.3",23.9844522,"+23 59 4.02",9.9600000000000009,9.34,"B0.5III:nn     ","B0","III:nn    ",296.42630869999999,23.9844522,1.6600000000000001]
["HD 344894","","*  ","","",296.45089539999998,"19 45 48.2",23.195201900000001,"+23 11 42.72",9.8800000000000008,9.61,"B2III:n        ","B2","III:n     ",296.45089539999998,23.195201900000001,1.3900000000000006]
["HD 187035","","*  ",null,"",296.46716500000002,"19 45 52.1",44.918641399999998,"+44 55 7.1",8.7899999999999991,8.83,"B7III          ",{"$f":"+LEFT(L1728,2)","v":"B7"},{"$f":"+IF(MID(L1728,3,1)=\".\",MID(L1728,5,10),MID(L1728,3,10))","v":"III       "},296.46716500000002,44.918641399999998,2.17]
["HD 186996","","*  ",null,"",296.48014749999999,"19 45 55.2",39.888878900000002,"+39 53 19.96",7.38,7.48,"B9IIIn         ","B9","IIIn      ",296.48014749999999,39.888878900000002,3.5199999999999996]
["HD 225707","","*  ",null,"",296.51330039999999,"19 46 3.1",35.781667200000001,"+35 46 54",10.039999999999999,9.968,"B8V            ","B8","V         ",296.51330039999999,35.781667200000001,{"$f":"11-K1730","v":1.032}]
["HD 344882","","*  ",null,"",296.60959580000002,"19 46 26.3",23.855358899999999,"+23 51 19.29",9.2200000000000006,9.1999999999999993,"B8V            ","B8","V         ",{"$f":"+F1731","v":296.60959580000002},{"$f":"+H1731","v":23.855358899999999},1.8000000000000007]
["HD 187037","","*  ",null,"",296.61038710000003,"19 46 26.4",35.041376700000001,"+35 2 28.95",8.15,8.24,"B8V            ","B8","V         ",296.61038710000003,35.041376700000001,2.76]
["HD 338889","","*  ",null,"",296.73793540000003,"19 46 57.1",26.7075803,"+26 42 27.28",9.0299999999999994,9.02,"B8V            ","B8","V         ",296.73793540000003,26.7075803,1.9800000000000004]
["HR 7543","","*i*",null,"",296.86575005999998,"19 47 27.7",38.407614199999998,"+38 24 27.41",5.7389999999999999,5.8259999999999996,"B8Vn           ","B8","Vn        ",296.86575005999998,38.407614199999998,5.1740000000000004]
["HD 225849","","*  ",null,"",296.98152040000002,"19 47 55.5",35.364813599999998,"+35 21 53.32",8.66,8.68,"B9V            ","B9","V         ",296.98152040000002,35.364813599999998,2.3200000000000003]
["HD 225859","","*  ","","",297.01016249999998,"19 48 2.4",35.232826699999997,"+35 13 58.17",9.0619999999999994,9.11,"B9V            ","B9","V         ",297.01016249999998,35.232826699999997,1.8900000000000006]
["HD 332691","","*  ",null,"",297.0207633,"19 48 4.9",29.860165599999998,"+29 51 36.59",8.94,8.9499999999999993,"B9V            ","B9","V         ",297.0207633,29.860165599999998,2.0500000000000007]
["HD 187320","","*  ","","",297.18437340999998,"19 48 44.2",19.661070720000001,"+19 39 39.85",7.5069999999999997,7.41,"B2III          ","B2","III       ",297.18437340999998,19.661070720000001,3.59]
["HD 339039","","*  ","","",297.19453709999999,"19 48 46.6",24.805833100000001,"+24 48 20.99",9.98,9.69,"B1.5V          ","B1","V         ",297.19453709999999,24.805833100000001,1.3100000000000005]
["V1765 Cyg","Var","bL*","","",297.21082561999998,"19 48 50.5",33.437282680000003,"+33 26 14.21",6.5819999999999999,6.468,"B0.5III        ","B0","III       ",297.21082561999998,33.437282680000003,4.532]
["HD 332727","","*  ","","",297.23236960000003,"19 48 55.7",28.809225300000001,"+28 48 33.21",9.4700000000000006,9.44,"B2V:n          ","B2","V:n       ",297.23236960000003,28.809225300000001,1.5600000000000005]
["HD 187613","","*i*",null,"",297.25375423999998,"19 49 0.9",44.37920287,"+44 22 45.13",7.72,7.18,"B8III          ","B8","III       ",297.25375423999998,44.37920287,3.8200000000000003]
["HD 331246","","*  ","","",297.27232452999999,"19 49 5.3",32.621597319999999,"+32 37 17.75",9,8.99,"B3V            ","B3","V         ",297.27232452999999,32.621597319999999,2.0099999999999998]
["HD 225985                ",{"$f":"IF(LEFT(A1744,2)=\"V*\",\"var\",\"\")","v":""},"Be*","","Be",297.38713999999999,"19 49 32.9",32.956193300000002," 32 57 22.29",9.19,9.16,"B1V:pshe       ","B1","V:pshe    ",297.38713999999999,32.956193300000002,1.8399999999999999]
["V379 Vul","Var","El*",null,"",297.47800229000001,"19 49 54.7",28.439674719999999,"+28 26 22.82",6.3410000000000002,6.444,"B5V             ","B5","V         ",297.47800229000001,28.439674719999999,4.556]
["V379 Vul","Var","El*",null,"",297.47800229000001,"19 49 54.7",28.439674719999999,"+28 26 22.82",6.3410000000000002,6.444,"B5V             ","B5","V         ",297.47800229000001,28.439674719999999,4.556]
["HR 7554","","Be*","","Be",297.57283095999998,"19 50 17.4",7.9024148299999997,"+7 54 8.69",6.399,6.484,"B2.5IVe        ","B2","IVe       ",297.57283095999998,7.9024148299999997,4.516]
["HD 187569","","*  ",null,"",297.65312829999999,"19 50 36.7",0.72451390000000004,"+0 43 28.25",8.92,8.8699999999999992,"B9V            ","B9","V         ",297.65312829999999,0.72451390000000004,2.1300000000000008]
["V* V380 Cyg              ",{"$f":"IF(LEFT(A1749,2)=\"V*\",\"var\",\"\")","v":"var"},"Al*","","",297.65553032000003,"19 50 37.3",40.599760510000003," 40 35 59.13",5.6219999999999999,5.68,"B1III+...      ","B1","III+...   ",297.65553032000003,40.599760510000003,5.32]
["HD 226107","","*  ",null,"",297.66179290000002,"19 50 38.8",35.840998900000002,"+35 50 27.59",8.5399999999999991,8.6,"B9IV           ","B9","IV        ",297.66179290000002,35.840998900000002,2.4000000000000004]
["HD 226130","","*  ",null,"",297.73839829999997,"19 50 57.2",35.400201099999997,"+35 24 0.72",9.02,9.0500000000000007,"B9V            ","B9","V         ",297.73839829999997,35.400201099999997,1.9499999999999993]
["HD 339003","","*  ","","",297.76191710000001,"19 51 2.8",25.954281699999999,"+25 57 15.41",10.43,9.93,"B0.5III        ","B0","III       ",297.76191710000001,25.954281699999999,1.0700000000000003]
["12 Vul","","Be*","","Be",297.76711755999997,"19 51 4.1",22.610048110000001,"+22 36 36.17",4.75,4.8929999999999998,"B2.5Ve         ","B2","Ve        ",297.76711755999997,22.610048110000001,6.1070000000000002]
["HD 187851","","Be*","","Be",297.7697412,"19 51 4.7",27.716906219999998,"+27 43 0.86",7.8360000000000003,7.7610000000000001,"B2V:nn         ","B2","V:nn      ",297.7697412,27.716906219999998,3.2389999999999999]
["HR 7591","","V* ","","",298.02986078999999,"19 52 7.1",47.931794740000001,"+47 55 54.46",5.7229999999999999,5.8929999999999998,"B2III          ","B2","III       ",298.02986078999999,47.931794740000001,5.1070000000000002]
["HR 7572","","Be*",null,"Be",298.06492328000002,"19 52 15.5",10.35158764,"+10 21 5.71",6.476,6.5030000000000001,"B7V+A5V        ","B7","V+A5V     ",298.06492328000002,10.35158764,4.4969999999999999]
["CCDM J19523+1021A","","*i*",null,"",298.06492900000001,"19 52 15.5",10.351594,"+10 21 5.73",6.47,6.51,"B7V            ","B7","V         ",298.06492900000001,10.351594,4.49]
["HD 332857","","*  ","","",298.11156460000001,"19 52 26.7",29.155771399999999,"+29 9 20.77",8.94,8.83,"B9V            ","B9","V         ",298.11156460000001,29.155771399999999,2.17]
["HD 188062","","*iC",null,"",298.16180330999998,"19 52 38.8",18.740689639999999,"+18 44 26.48",7.63,7.67,"B8V            ","B8","V         ",298.16180330999998,18.740689639999999,3.33]
["HD 188306","","*  ",null,"",298.18060500000001,"19 52 43.3",43.9941356,"+43 59 38.88",8.5299999999999994,8.58,"B9V            ","B9","V         ",298.18060500000001,43.9941356,2.42]
["HD 345122","","Be*","","Be",298.21425369999997,"19 52 51.4",22.239626099999999,"+22 14 22.65",10.15,9.8000000000000007,"B2Vpe...       ","B2","Vpe...    ",298.21425369999997,22.239626099999999,1.1999999999999993]
["V819 Cyg","Var","bC*","","",298.25519331999999,"19 53 1.2",47.807719949999999,"+47 48 27.79",6.165,6.2880000000000003,"B0.5IIIn       ","B0","IIIn      ",298.25519331999999,47.807719949999999,4.7119999999999997]
["HD 226356","","*  ",null,"",298.2958362,"19 53 11",35.116390299999999,"+35 6 59",9.57,9.61,"B8IV           ","B8","IV        ",298.2958362,35.116390299999999,1.3900000000000006]
["HD 339086","","*  ",null,"",298.30324653999998,"19 53 12.7",26.80400569,"+26 48 14.42",9.9499999999999993,9.7100000000000009,"B9V            ","B9","V         ",298.30324653999998,26.80400569,1.2899999999999991]
["23 Cyg","","*  ",null,"",298.32240687000001,"19 53 17.3",57.523480290000002,"+57 31 24.52",5.0090000000000003,5.1319999999999997,"B5V             ","B5","V         ",298.32240687000001,57.523480290000002,5.8680000000000003]
["23 Cyg","","*  ",null,"",298.32240687000001,"19 53 17.3",57.523480290000002,"+57 31 24.52",5.0090000000000003,5.1319999999999997,"B5V             ","B5","V         ",298.32240687000001,57.523480290000002,5.8680000000000003]
["HD 188461","","*  ","","",298.41036009999999,"19 53 38.4",41.355781069999999,"+41 21 20.81",6.83,6.99,"B2IV           ","B2","IV        ",298.41036009999999,41.355781069999999,4.01]
["HD 345214","","*i*",null,"",298.44161506,"19 53 45.9",22.609455910000001,"+22 36 34.04",9.85,9.69,"B5III           ","B5","III       ",298.44161506,22.609455910000001,1.3100000000000005]
["HD 345214","","*i*",null,"",298.44161506,"19 53 45.9",22.609455910000001,"+22 36 34.04",9.85,9.69,"B5III           ","B5","III       ",298.44161506,22.609455910000001,1.3100000000000005]
["HD 226437","","*  ",null,"",298.51975420000002,"19 54 4.7",35.826500000000003,"+35 49 35.4",9.9700000000000006,9.9009999999999998,"B9V            ","B9","V         ",298.51975420000002,35.826500000000003,1.0990000000000002]
["HD 188503","","*  ",null,"",298.58498155000001,"19 54 20.3",30.704215529999999,"+30 42 15.17",8.42,8.51,"B8III          ","B8","III       ",298.58498155000001,30.704215529999999,2.4900000000000002]
["CCDM J19544+3001AB","","** ",null,"",298.59613947000003,"19 54 23",30.02527903,"+30 1 31",8.5399999999999991,8.4629999999999992,"B7III          ","B7","III       ",298.59613947000003,30.02527903,2.5370000000000008]
["HD 345179","","*  ","","",298.71304600000002,"19 54 51.1",23.467421999999999,"+23 28 2.71",10.52,9.66,"B2V            ","B2","V         ",298.71304600000002,23.467421999999999,1.3399999999999999]
["HD 188612","","*  ",null,"",298.72878444000003,"19 54 54.9",30.146908660000001,"+30 8 48.87",8.2100000000000009,8.24,"B6V            ","B6","V         ",298.72878444000003,30.146908660000001,2.76]
["HD 345180","","*  ","","",298.74317274999999,"19 54 58.3",23.47642205,"+23 28 35.11",9.99,9.65,"B2V:           ","B2","V:        ",298.74317274999999,23.47642205,1.3499999999999996]
["HR 7607","","*i*",null,"",298.77709592000002,"19 55 6.5",30.194898689999999,"+30 11 41.63",6.49,6.57,"B6V+...        ","B6","V+...     ",298.77709592000002,30.194898689999999,4.43]
["HD 339184","","Em*","Em","",298.79679870000001,"19 55 11.2",26.5829919,"+26 34 58.77",8.9440000000000008,8.67,"B5Ve            ","B5","Ve        ",298.79679870000001,26.5829919,2.33]
["HD 339184","","Em*","Em","",298.79679870000001,"19 55 11.2",26.5829919,"+26 34 58.77",8.9440000000000008,8.67,"B5Ve            ","B5","Ve        ",298.79679870000001,26.5829919,2.33]
["HD 332938","","*  ",null,"",298.88093959999998,"19 55 31.4",30.512173600000001,"+30 30 43.82",9.5,9.1199999999999992,"B9III          ","B9","III       ",298.88093959999998,30.512173600000001,1.8800000000000008]
["HD 188891                ",{"$f":"IF(LEFT(A1780,2)=\"V*\",\"var\",\"\")","v":""},"*i*","","",298.93651060000002,"19 55 44.7",40.391737159999998," 40 23 30.25",7.29,7.3,"B1V            ","B1","V         ",298.93651060000002,40.391737159999998,3.7]
["22 Cyg","","*  ",null,"",298.96567866999999,"19 55 51.7",38.486705600000001,"+38 29 12.14",4.8540000000000001,4.9429999999999996,"B5IV            ","B5","IV        ",298.96567866999999,38.486705600000001,6.0570000000000004]
["22 Cyg","","*  ",null,"",298.96567866999999,"19 55 51.7",38.486705600000001,"+38 29 12.14",4.8540000000000001,4.9429999999999996,"B5IV            ","B5","IV        ",298.96567866999999,38.486705600000001,6.0570000000000004]
["HD 331549","","*  ","","",299.09800616000001,"19 56 23.5",31.369244219999999,"+31 22 9.27",9.18,9.2100000000000009,"B9V            ","B9","V         ",299.09800616000001,31.369244219999999,1.7899999999999991]
["HR 7620","","*  ",null,null,299.18393242000002,"19 56 44.1",36.250598089999997,"+36 15 2.15",5.8739999999999997,6.01,"B5IV            ","B5","IV        ",299.18393242000002,36.250598089999997,4.99]
["HR 7620","","*  ",null,null,299.18393242000002,"19 56 44.1",36.250598089999997,"+36 15 2.15",5.8739999999999997,6.01,"B5IV            ","B5","IV        ",299.18393242000002,36.250598089999997,4.99]
["HD 333132","","*  ",null,null,299.22925830000003,"19 56 55",29.788721899999999,"+29 47 19.39",9.1300000000000008,9.07,"B8V            ","B8","V         ",299.22925830000003,29.788721899999999,1.9299999999999997]
["HD 333064","","*i*",null,null,299.27188790000002,"19 57 5.2",31.073025300000001,"+31 4 22.89",9.4700000000000006,9.4600000000000009,"B9V            ","B9","V         ",299.27188790000002,31.073025300000001,1.5399999999999991,null,{"$f":"+COUNTA(E:E)","v":2675}]
["HD 189107","","*  ",null,null,299.29439306,"19 57 10.6",30.856320740000001,"+30 51 22.75",7.4580000000000002,7.5090000000000003,"B8V            ","B8","V         ",299.29439306,30.856320740000001,3.4909999999999997]
["HR 7628","","*  ",null,null,299.30778329999998,"19 57 13.8",40.367825949999997,"+40 22 4.17",5.3639999999999999,5.4530000000000003,"B5V             ","B5","V         ",299.30778329999998,40.367825949999997,5.5469999999999997]
["HR 7628","","*  ",null,null,299.30778329999998,"19 57 13.8",40.367825949999997,"+40 22 4.17",5.3639999999999999,5.4530000000000003,"B5V             ","B5","V         ",299.30778329999998,40.367825949999997,5.5469999999999997]
["HD 226795","","V* ",null,null,299.35320919999998,"19 57 24.7",40.635686399999997,"+40 38 8.47",9.8450000000000006,9.89,"B5.5V          ","B5","V         ",299.35320919999998,40.635686399999997,1.1099999999999994]
["HD 226795","","V* ",null,null,299.35320919999998,"19 57 24.7",40.635686399999997,"+40 38 8.47",9.8450000000000006,9.89,"B5.5V          ",{"$f":"+LEFT(L1792,2)","v":"B5"},{"$f":"+IF(MID(L1792,3,1)=\".\",MID(L1792,5,10),MID(L1792,3,10))","v":"V         "},299.35320919999998,40.635686399999997,1.1099999999999994]
["HD 333078","","*  ",null,null,299.37188709999998,"19 57 29.2",30.906136700000001,"+30 54 22.09",9.5399999999999991,9.5299999999999994,"B8III          ","B8","III       ",299.37188709999998,30.906136700000001,1.4700000000000006]
["HD 333135","","*  ",null,null,299.43197750000002,"19 57 43.6",29.697576900000001,"+29 41 51.27",9.51,9.4700000000000006,"B7.5V          ","B7","V         ",299.43197750000002,29.697576900000001,{"$f":"11-K1794","v":1.5299999999999994}]
["11 Sge","","*  ",null,null,299.43935764000003,"19 57 45.4",16.789160880000001,"+16 47 20.97",5.4850000000000003,5.5330000000000004,"B9III          ","B9","III       ",{"$f":"+F1795","v":299.43935764000003},{"$f":"+H1795","v":16.789160880000001},5.4669999999999996]
["HD 189316","","*i*",null,null,299.59745187999999,"19 58 23.3",28.988160319999999,"+28 59 17.37",7.7169999999999996,7.7320000000000002,"B9V            ","B9","V         ",299.59745187999999,28.988160319999999,3.2679999999999998]
["HD 189394","","Pu*",null,null,299.60909959999998,"19 58 26.1",34.513042200000001,"+34 30 46.95",8.3000000000000007,8.3800000000000008,"B9p            ","B9","p         ",299.60909959999998,34.513042200000001,2.6199999999999992]
["CCDM J19586+3806AB","","** ",null,null,299.64315637999999,"19 58 34.3",38.105694909999997,"+38 6 20.5",6.23,6.32,"B5IV            ","B5","IV        ",299.64315637999999,38.105694909999997,4.68]
["CCDM J19586+3806AB","","** ",null,null,299.64315637999999,"19 58 34.3",38.105694909999997,"+38 6 20.5",6.23,6.32,"B5IV            ","B5","IV        ",299.64315637999999,38.105694909999997,4.68]
["HR 7640","","*  ",null,"",299.65825683000003,"19 58 37.9",30.983665089999999,"+30 59 1.19",5.4470000000000001,5.5060000000000002,"B9Vn           ","B9","Vn        ",299.65825683000003,30.983665089999999,5.4939999999999998]
["HD 333090","","*  ",null,"",299.69518119999998,"19 58 46.8",30.497217200000001,"+30 29 49.98",9.5399999999999991,9.5,"B8V            ","B8","V         ",299.69518119999998,30.497217200000001,1.5]
["CCDM J19591+3533AB","","** ",null,"",299.78110615999998,"19 59 7.4",35.536148349999998,"+35 32 10.13",8.5500000000000007,8.5299999999999994,"B9V            ","B9","V         ",299.78110615999998,35.536148349999998,2.4700000000000006]
["HD 226951","","Em*","Em","",299.79819079999999,"19 59 11.5",36.115328300000002,"+36 6 55.18",9.25,9.15,"B0.5III        ","B0","III       ",299.79819079999999,36.115328300000002,1.8499999999999996]
["V2100 Cyg","Var","a2*",null,"",299.81394240999998,"19 59 15.3",52.055690460000001,"+52 3 20.48",5.9589999999999996,6.1139999999999999,"B5III           ","B5","III       ",299.81394240999998,52.055690460000001,4.8860000000000001]
["V2100 Cyg","Var","a2*",null,"",299.81394240999998,"19 59 15.3",52.055690460000001,"+52 3 20.48",5.9589999999999996,6.1139999999999999,"B5III           ","B5","III       ",299.81394240999998,52.055690460000001,4.8860000000000001]
["HD 333213","","*  ",null,"",299.84927119999998,"19 59 23.8",30.826305600000001,"+30 49 34.7",9.5500000000000007,9.49,"B8V            ","B8","V         ",299.84927119999998,30.826305600000001,1.5099999999999998]
["25 Cyg","","Be*","","Be",299.97998237000002,"19 59 55.1",37.042885920000003,"+37 2 34.38",5.0090000000000003,5.1390000000000002,"B3IVe          ","B3","IVe       ",299.97998237000002,37.042885920000003,5.8609999999999998]
["HD 189550","","*  ","","",299.98240405000001,"19 59 55.7",19.88949989,"+19 53 22.19",7.62,7.67,"B2V            ","B2","V         ",299.98240405000001,19.88949989,3.33]
["HD 189706","","*  ",null,"",300.08016171999998,"20 0 19.2",29.82151391,"+29 49 17.45",7.68,7.76,"B9V            ","B9","V         ",300.08016171999998,29.82151391,3.24]
["HD 189779","","*  ","","",300.15702905000001,"20 0 37.6",29.888574129999999,"+29 53 18.86",8.2799999999999994,8.23,"B2III          ","B2","III       ",300.15702905000001,29.888574129999999,2.7699999999999996]
["HD 189659","","V* ",null,"",300.18558266999997,"20 0 44.5",11.031859300000001,"+11 1 54.69",8.5500000000000007,8.58,"B7V            ","B7","V         ",300.18558266999997,11.031859300000001,2.42]
["HD 227110","","*  ",null,"",300.20140170000002,"20 0 48.3",39.437806899999998,"+39 26 16.1",9.327,9.3930000000000007,"B9V            ","B9","V         ",300.20140170000002,39.437806899999998,1.6069999999999993]
["HD 189846","","*  ",null,"",300.22700874999998,"20 0 54.4",33.012490030000002,"+33 0 44.96",8.32,8.35,"B6V            ","B6","V         ",300.22700874999998,33.012490030000002,2.6500000000000004]
["HD 333271","","*  ",null,"",300.23365799999999,"20 0 56",29.675044,"+29 40 30.15",10,9.82,"B8III:         ","B8","III:      ",300.23365799999999,29.675044,1.1799999999999997]
["HD 189847","","*  ",null,"",300.24476285999998,"20 0 58.7",31.230461470000002,"+31 13 49.66",6.8170000000000002,6.9219999999999997,"B7V            ","B7","V         ",300.24476285999998,31.230461470000002,4.0780000000000003]
["HD 189957","","*  ","","",300.25001701999997,"20 1 0",42.008563610000003,"+42 0 30.82",7.84,7.82,"B0III          ","B0","III       ",300.25001701999997,42.008563610000003,3.1799999999999997]
["HD 189848","","*  ",null,"",300.27064693,"20 1 4.9",29.14049464,"+29 8 25.78",8.17,8.2200000000000006,"B7III          ","B7","III       ",300.27064693,29.14049464,2.7799999999999994]
["HD 333209","","*  ","","",300.31329210000001,"20 1 15.1",30.857123900000001,"+30 51 25.64",9.48,9.4499999999999993,"B9V            ","B9","V         ",300.31329210000001,30.857123900000001,1.5500000000000007]
["HD 189983","","*  ",null,"",300.39111269,"20 1 33.8",34.583086559999998,"+34 34 59.11",8.57,8.5399999999999991,"B8V            ","B8","V         ",300.39111269,34.583086559999998,2.4600000000000009]
["HD 190001","","*  ",null,"",300.43095675000001,"20 1 43.4",33.066929129999998,"+33 4 0.94",7.9,7.98,"B6V            ","B6","V         ",300.43095675000001,33.066929129999998,3.0199999999999996]
["HR 7656","","*  ",null,"",300.43629594999999,"20 1 44.7",24.800421780000001,"+24 48 1.51",5.7389999999999999,5.8719999999999999,"B4V            ","B4","V         ",300.43629594999999,24.800421780000001,5.1280000000000001]
["HD 190047","","*  ",null,"",300.48144456,"20 1 55.5",31.11756622,"+31 7 3.23",6.532,6.6079999999999997,"B7V            ","B7","V         ",300.48144456,31.11756622,4.3920000000000003]
["HD 333410","","Be*",null,"Be",300.50543592999998,"20 2 1.3",29.585882040000001,"+29 35 9.17",9.18,9.1300000000000008,"B8V            ","B8","V         ",300.50543592999998,29.585882040000001,1.8699999999999992]
["HD 190114","","*  ",null,"",300.50757211000001,"20 2 1.8",35.332474310000002,"+35 19 56.9",7.34,7.41,"B8V            ","B8","V         ",300.50757211000001,35.332474310000002,3.59]
["HD 189921","","*  ",null,"",300.54301035999998,"20 2 10.3",10.73894814,"+10 44 20.21",6.8940000000000001,6.9859999999999998,"B5V             ","B5","V         ",300.54301035999998,10.73894814,4.0140000000000002]
["HD 189921","","*  ",null,"",300.54301035999998,"20 2 10.3",10.73894814,"+10 44 20.21",6.8940000000000001,6.9859999999999998,"B5V             ","B5","V         ",300.54301035999998,10.73894814,4.0140000000000002]
["HD 227228","","*  ",null,"",300.56902580000002,"20 2 16.5",34.707264700000003,"+34 42 26.15",9.25,9.25,"B7IV           ","B7","IV        ",300.56902580000002,34.707264700000003,1.75]
["HD 333384","","*  ",null,"",300.57402000000002,"20 2 17.7",30.132770799999999,"+30 7 57.97",9.41,9.39,"B9V            ","B9","V         ",300.57402000000002,30.132770799999999,1.6099999999999994]
["HD 227273","","*  ",null,"",300.58794380000001,"20 2 21.1",38.3828253,"+38 22 58.17",9.65,9.5399999999999991,"B9III          ","B9","III       ",300.58794380000001,38.3828253,1.4600000000000009]
["HD 331702","","*  ",null,"",300.58855249999999,"20 2 21.2",31.6214981,"+31 37 17.39",9.3800000000000008,9.3800000000000008,"B7V            ","B7","V         ",300.58855249999999,31.6214981,1.6199999999999992]
["HBHA 3703-48","","Em*","Em","",300.60874999999999,"20 2 26.1",36.446669999999997,"+36 26 48.01",null,8,"B6IV-Ve        ","B6","IV-Ve     ",300.60874999999999,36.446669999999997,3]
["HD 227310","","*  ",null,"",300.67376152000003,"20 2 41.7",38.393336099999999,"+38 23 36",9.4019999999999992,9.4209999999999994,"B5IV            ","B5","IV        ",300.67376152000003,38.393336099999999,1.5790000000000006]
["HD 227310","","*  ",null,"",300.67376152000003,"20 2 41.7",38.393336099999999,"+38 23 36",9.4019999999999992,9.4209999999999994,"B5IV            ","B5","IV        ",300.67376152000003,38.393336099999999,1.5790000000000006]
["HD 227292","","*  ",null,"",300.69017669999999,"20 2 45.6",33.628132800000003,"+33 37 41.27",9.2200000000000006,9.24,"B5V             ","B5","V         ",300.69017669999999,33.628132800000003,1.7599999999999998]
["HD 227292","","*  ",null,"",300.69017669999999,"20 2 45.6",33.628132800000003,"+33 37 41.27",9.2200000000000006,9.24,"B5V             ","B5","V         ",300.69017669999999,33.628132800000003,1.7599999999999998]
["HD 227306","","*  ",null,"",300.70061620000001,"20 2 48.1",33.792739699999998,"+33 47 33.86",9.73,9.67,"B8V            ","B8","V         ",300.70061620000001,33.792739699999998,1.33]
["HD 190256","","*  ",null,"",300.71823646000001,"20 2 52.3",32.577414490000002,"+32 34 38.69",8.4499999999999993,8.51,"B7V            ","B7","V         ",300.71823646000001,32.577414490000002,2.4900000000000002]
["HD 190427","","*  ","","",300.73143626000001,"20 2 55.5",45.986912089999997,"+45 59 12.88",8.4700000000000006,8.3699999999999992,"B0III          ","B0","III       ",300.73143626000001,45.986912089999997,2.6300000000000008]
["HD 333452","","Be*","","Be",300.79590039999999,"20 3 11",28.705678299999999,"+28 42 20.44",10.28,9.49,"B0III:np       ","B0","III:np    ",300.79590039999999,28.705678299999999,1.5099999999999998]
["HD 190382","","*  ",null,"",300.86359499999998,"20 3 27.2",33.543152800000001,"+33 32 35.35",9.1,9.1199999999999992,"B6V            ","B6","V         ",300.86359499999998,33.543152800000001,1.8800000000000008]
["BD+35 3929               ",{"$f":"IF(LEFT(A1841,2)=\"V*\",\"var\",\"\")","v":""},"*i*","","",300.86440399999998,"20 3 27.4",36.034789000000004," 36 2 5.24",9.8800000000000008,9.7100000000000009,"B1III          ","B1","III       ",300.86440399999998,36.034789000000004,1.2899999999999991]
["BD+35 3930B","","*i*","","",300.87209999999999,"20 3 29.3",36.024700000000003,"+36 1 28.92",6.8,6.6,"O9.5III          ","O9","III       ",300.87209999999999,36.024700000000003,4.4000000000000004]
["14 Sge","","*  ",null,"",300.87506639999998,"20 3 30",16.0312515,"+16 1 52.5",5.5570000000000004,5.6639999999999997,"B9mnp...       ","B9","mnp...    ",300.87506639999998,16.0312515,5.3360000000000003]
["HD 190428","","*  ",null,"",300.87762829000002,"20 3 30.6",37.41055497,"+37 24 37.99",8.83,8.8000000000000007,"B9V            ","B9","V         ",300.87762829000002,37.41055497,2.1999999999999993]
["HD 331810","","*  ",null,"",300.97069420000003,"20 3 52.9",31.209340600000001,"+31 12 33.62",9.7100000000000009,9.6,"B8V            ","B8","V         ",300.97069420000003,31.209340600000001,1.4000000000000004]
["HD 190469","","*  ",null,"",300.98451103000002,"20 3 56.2",31.123779200000001,"+31 7 25.6",7.76,7.81,"B7V            ","B7","V         ",300.98451103000002,31.123779200000001,3.1900000000000004]
["HD 339483                ",{"$f":"IF(LEFT(A1847,2)=\"V*\",\"var\",\"\")","v":""},"Be*","","Be",301.00310586000001,"20 4 0.7",26.27132164," 26 16 16.75",9.5,8.98,"B1III          ","B1","III       ",301.00310586000001,26.27132164,2.0199999999999996]
["HD 227423","","*  ",null,"",301.0115146,"20 4 2.7",33.9001339,"+33 54 0.48",9.56,9.5399999999999991,"B8V            ","B8","V         ",301.0115146,33.9001339,1.4600000000000009]
["HD 190570","","*  ",null,"",301.0274632,"20 4 6.5",37.182107819999999,"+37 10 55.58",8.14,8.16,"B9V            ","B9","V         ",301.0274632,37.182107819999999,2.84]
["HD 227450","","*  ",null,"",301.0932062,"20 4 22.3",32.990999700000003,"+32 59 27.59",9.17,9.18,"B8V            ","B8","V         ",301.0932062,32.990999700000003,1.8200000000000003]
["HD 227461","","*iA",null,"",301.0959962,"20 4 23",35.719225600000001,"+35 43 9.21",9.9,9.8290000000000006,"B8V            ","B8","V         ",301.0959962,35.719225600000001,1.1709999999999994]
["HD 190628","","*  ",null,"",301.10509117999999,"20 4 25.2",38.332440839999997,"+38 19 56.78",8.41,8.43,"B9IV           ","B9","IV        ",301.10509117999999,38.332440839999997,2.5700000000000003]
["HD 333375","","*  ",null,"",301.1449179,"20 4 34.7",30.264781899999999,"+30 15 53.21",9.2799999999999994,9.31,"B9III          ","B9","III       ",301.1449179,30.264781899999999,1.6899999999999995]
["HD 190604","","*  ",null,"",301.16385739999998,"20 4 39.3",30.731357920000001,"+30 43 52.88",8.58,8.61,"B7V            ","B7","V         ",301.16385739999998,30.731357920000001,2.3900000000000006]
["HD 227536","","*  ",null,"",301.28337169999998,"20 5 8",36.1558797,"+36 9 21.16",9.69,9.5,"B9V            ","B9","V         ",301.28337169999998,36.1558797,1.5]
["HD 227573","","Em*","Em","",301.35663419999997,"20 5 25.5",36.087988299999999,"+36 5 16.75",9.74,9.65,"B7IV           ",{"$f":"+LEFT(L1856,2)","v":"B7"},{"$f":"+IF(MID(L1856,3,1)=\".\",MID(L1856,5,10),MID(L1856,3,10))","v":"IV        "},301.35663419999997,36.087988299999999,1.3499999999999996]
["HD 190944","","Be*","","Be",301.35692535999999,"20 5 25.6",46.671818860000002,"+46 40 18.54",8.5399999999999991,8.36,"B1.5Vne        ","B1","Vne       ",301.35692535999999,46.671818860000002,2.6400000000000006]
["HD 190863","","*  ",null,"",301.38929461999999,"20 5 33.4",37.734913179999999,"+37 44 5.68",9.11,9.06,"B8V            ","B8","V         ",301.38929461999999,37.734913179999999,{"$f":"11-K1858","v":1.9399999999999995}]
["HD 190813","","V* ",null,"",301.39620830000001,"20 5 35",33.485660000000003,"+33 29 8.37",8.7100000000000009,8.68,"B7III          ","B7","III       ",{"$f":"+F1859","v":301.39620830000001},{"$f":"+H1859","v":33.485660000000003},2.3200000000000003]
["HD 227586","","*i*","","",301.40152869999997,"20 5 36.3",35.623183300000001,"+35 37 23.45",8.98,8.86,"B0.5IVp        ","B0","IVp       ",301.40152869999997,35.623183300000001,2.1400000000000006]
["HD 331727","","*  ",null,"",301.48000330000002,"20 5 55.2",32.786664199999997,"+32 47 11.99",9.33,9.31,"B6III          ","B6","III       ",301.48000330000002,32.786664199999997,1.6899999999999995]
["BD+35 3953D              ",{"$f":"IF(LEFT(A1862,2)=\"V*\",\"var\",\"\")","v":""},"*i*","","",301.48550852,"20 5 56.5",35.789946460000003," 35 47 23.8",9.92,9.7200000000000006,"B1V            ","B1","V         ",301.48550852,35.789946460000003,1.2799999999999994]
["BD+35 3956","","*iC","","",301.4999062,"20 5 59.9",35.762347200000001,"+35 45 44.44",9.01,8.86,"B0.5V          ","B0","V         ",301.4999062,35.762347200000001,2.1400000000000006]
["HD 190991","","*  ","","",301.50295188000001,"20 6 0.7",40.064976999999999,"+40 3 53.91",8.3000000000000007,8.2200000000000006,"B0IVp          ","B0","IVp       ",301.50295188000001,40.064976999999999,2.7799999999999994]
["HD 333492","","*  ",null,"",301.50828209999997,"20 6 1.9",30.901723100000002,"+30 54 6.2",9.93,9.84,"B8V            ","B8","V         ",301.50828209999997,30.901723100000002,1.1600000000000001]
["HD 331850","","*  ",null,"",301.57247169999999,"20 6 17.3",31.799015300000001,"+31 47 56.45",9.01,8.82,"B5V             ","B5","V         ",301.57247169999999,31.799015300000001,2.1799999999999997]
["HD 331850","","*  ",null,"",301.57247169999999,"20 6 17.3",31.799015300000001,"+31 47 56.45",9.01,8.82,"B5V             ","B5","V         ",301.57247169999999,31.799015300000001,2.1799999999999997]
["V453 Cyg              ",{"$f":"IF(LEFT(A1868,2)=\"V*\",\"var\",\"\")","v":""},"Al*","","",301.64569790000002,"20 6 34.9",35.7406322," 35 44 26.27",8.52,8.4,"B1III          ","B1","III       ",301.64569790000002,35.7406322,2.5999999999999996]
["HD 227704","","*i*","","",301.67088481000002,"20 6 41",34.911183039999997,"+34 54 40.25",8.9499999999999993,8.6999999999999993,"B0III          ","B0","III       ",301.67088481000002,34.911183039999997,2.3000000000000007]
["HD 191064","","*iC",null,"",301.69179466999998,"20 6 46",33.476629019999997,"+33 28 35.86",8.36,8.39,"B9III          ","B9","III       ",301.69179466999998,33.476629019999997,2.6099999999999994]
["HD 227728","","*  ","","",301.70641380000001,"20 6 49.5",38.027601400000002,"+38 1 39.36",10.071,9.9160000000000004,"B2V            ","B2","V         ",301.70641380000001,38.027601400000002,1.0839999999999996]
["17 Vul","","*  ","","",301.72253279,"20 6 53.4",23.614424840000002,"+23 36 51.92",4.9039999999999999,5.0640000000000001,"B3V            ","B3","V         ",301.72253279,23.614424840000002,5.9359999999999999]
["HD 227722                ",{"$f":"IF(LEFT(A1873,2)=\"V*\",\"var\",\"\")","v":""},"*  ","","",301.72431499999999,"20 6 53.8",35.306098300000002," 35 18 21.95",9.68,9.5500000000000007,"B1III          ","B1","III       ",301.72431499999999,35.306098300000002,1.4499999999999993]
["HD 191139","","*  ","","",301.74004772000001,"20 6 57.6",36.396581419999997,"+36 23 47.69",8.17,8.02,"B0.5III        ","B0","III       ",301.74004772000001,36.396581419999997,2.9800000000000004]
["HD 227741","","*i*",null,"",301.76107580000001,"20 7 2.6",36.855297200000003,"+36 51 19.06",9.4090000000000007,9.39,"B8V            ","B8","V         ",301.76107580000001,36.855297200000003,1.6099999999999994]
["HD 227749","","Em*","Em","",301.76708960000002,"20 7 4.1",38.094478600000002,"+38 5 40.12",9.58,9.58,"B8V            ","B8","V         ",301.76708960000002,38.094478600000002,1.42]
["HD 190995","","*i*",null,"",301.79890399999999,"20 7 11.7",10.608650000000001,"+10 36 31.14",8.81,8.83,"B9V            ","B9","V         ",301.79890399999999,10.608650000000001,2.17]
["HD 227757","","*  ","","",301.80321500000002,"20 7 12.7",36.359284199999998,"+36 21 33.42",9.41,9.27,"O9.5V            ","O9","V         ",301.80321500000002,36.359284199999998,1.7300000000000004]
["HD 227758","","*i*",null,"",301.81760329999997,"20 7 16.2",35.574446399999999,"+35 34 28",9.24,9.18,"B9V            ","B9","V         ",301.81760329999997,35.574446399999999,1.8200000000000003]
["HD 227767","","*  ","","",301.82917370000001,"20 7 19",35.584861099999998,"+35 35 5.49",8.91,8.9,"B2III:         ","B2","III:      ",301.82917370000001,35.584861099999998,2.0999999999999996]
["HD 191201","","SB*","","",301.84869044999999,"20 7 23.6",35.71829718,"+35 43 5.86",7.43,7.34,"O9.5IV           ","O9","IV        ",301.84869044999999,35.71829718,3.66]
["HD 333526","","*  ","","",301.88338540000001,"20 7 32",29.929638600000001,"+29 55 46.69",9.82,9.76,"B9V            ","B9","V         ",301.88338540000001,29.929638600000001,1.2400000000000002]
["HD 227784","","*  ",null,"",301.89623210000002,"20 7 35",35.835498600000001,"+35 50 7.79",9.57,9.57,"B8V            ","B8","V         ",301.89623210000002,35.835498600000001,1.4299999999999997]
["HD 227818","","*  ","","",301.94874290000001,"20 7 47.6",37.443423899999999,"+37 26 36.32",9.84,9.74,"B3III          ","B3","III       ",301.94874290000001,37.443423899999999,1.2599999999999998]
["HD 191291","","*  ",null,"",301.98131626000003,"20 7 55.5",35.104836970000001,"+35 6 17.41",8.06,8.1199999999999992,"B6III          ","B6","III       ",301.98131626000003,35.104836970000001,2.8800000000000008]
["HD 227827","","*  ","","",301.98564829999998,"20 7 56.5",35.866452799999998,"+35 51 59.23",9.3670000000000009,9.2140000000000004,"B9V            ","B9","V         ",301.98564829999998,35.866452799999998,1.7859999999999996]
["HD 333514","","*  ",null,"",302.00523500000003,"20 8 1.2",30.4560803,"+30 27 21.88",9.8000000000000007,9.67,"B9V            ","B9","V         ",302.00523500000003,30.4560803,1.33]
["HD 191395","","*  ","","",302.03244625000002,"20 8 7.7",39.750796340000001,"+39 45 2.86",8.49,8.4600000000000009,"B0.5V:         ","B0","V:        ",302.03244625000002,39.750796340000001,2.5399999999999991]
["HD 227849","","*  ",null,"",302.0516508,"20 8 12.3",35.741027199999998,"+35 44 27.69",9.66,9.56,"B8III          ","B8","III       ",302.0516508,35.741027199999998,1.4399999999999995]
["HD 227902                ",{"$f":"IF(LEFT(A1890,2)=\"V*\",\"var\",\"\")","v":""},"*  ","","",302.14465000000001,"20 8 34.7",37.501069000000001," 37 30 3.84",9.49,9.2799999999999994,"B1V            ","B1","V         ",302.14465000000001,37.501069000000001,1.7200000000000006]
["HD 191456","","*  ","","",302.14999796000001,"20 8 35.9",36.672021209999997,"+36 40 19.27",7.5,7.43,"B0.5III        ","B0","III       ",302.14999796000001,36.672021209999997,3.5700000000000003]
["HR 7700","","*  ",null,"",302.15950091000002,"20 8 38.2",10.725866760000001,"+10 43 33.12",6.1989999999999998,6.3319999999999999,"B3V            ","B3","V         ",302.15950091000002,10.725866760000001,4.6680000000000001]
["HD 227915","","*  ",null,"",302.17033040000001,"20 8 40.8",36.510214699999999,"+36 30 36.77",9.49,9.51,"B7V            ","B7","V         ",302.17033040000001,36.510214699999999,1.4900000000000002]
["HD 191381","","*  ","","",302.17992321000003,"20 8 43.1",26.27485489,"+26 16 29.47",7.66,7.63,"B2IV           ","B2","IV        ",302.17992321000003,26.27485489,3.37]
["V2107 Cyg","Var","bL*","","",302.19071518999999,"20 8 45.7",37.237043919999998,"+37 14 13.35",8.64,8.58,"B0IV           ","B0","IV        ",302.19071518999999,37.237043919999998,2.42]
["V1473 Aql","Var","LP*",null,"",302.20698833,"20 8 49.6",12.22836509,"+12 13 42.11",7.12,7.16,"B7III          ","B7","III       ",302.20698833,12.22836509,3.84]
["HD 227920","","*iC","","",302.2143863,"20 8 51.4",34.320011899999997,"+34 19 12.04",9.2899999999999991,9.18,"B3V            ","B3","V         ",302.2143863,34.320011899999997,1.8200000000000003]
["HD 191494","","*  ",null,"",302.21579869999999,"20 8 51.7",36.146279200000002,"+36 8 46.6",8.77,8.74,"B8V            ","B8","V         ",302.21579869999999,36.146279200000002,2.2599999999999998]
["BD+35 3986","","Em*","Em","",302.21895999999998,"20 8 52.5",35.580170000000003,"+35 34 48.61",10.55,9.98,"B0pe           ","B0","pe        ",302.21895999999998,35.580170000000003,1.0199999999999996]
["CCDM J20088+7743AB","","** ",null,"",302.22228441999999,"20 8 53.3",77.711420869999998,"+77 42 41.11",4.3550000000000004,4.3949999999999996,"B9III          ","B9","III       ",302.22228441999999,77.711420869999998,6.6050000000000004]
["HD 191495","","*i*","","",302.22312290000002,"20 8 53.5",35.5128925,"+35 30 46.41",8.4700000000000006,8.42,"B0IV-V(n)      ","B0","IV-V(n)   ",302.22312290000002,35.5128925,2.58]
["HD 227958","","*  ",null,"",302.27197100000001,"20 9 5.2",37.492243999999999,"+37 29 32.07",9.9600000000000009,9.7899999999999991,"B8V            ","B8","V         ",302.27197100000001,37.492243999999999,1.2100000000000009]
["HD 191566","","SB*","","",302.30967006999998,"20 9 14.3",35.483849530000001,"+35 29 1.85",7.83,7.72,"B0.5IV         ","B0","IV        ",302.30967006999998,35.483849530000001,3.2800000000000002]
["HD 227977","","*  ","","",302.32173829999999,"20 9 17.2",37.502201399999997,"+37 30 7.92",9.8000000000000007,9.68,"B2III          ","B2","III       ",302.32173829999999,37.502201399999997,1.3200000000000003]
["HD 191401","","*  ",null,"",302.34453245999998,"20 9 22.6",10.78606405,"+10 47 9.83",7.46,7.57,"B6V            ","B6","V         ",302.34453245999998,10.78606405,3.4299999999999997]
["HD 191568","","*iC",null,"",302.34940065000001,"20 9 23.8",33.38769448,"+33 23 15.7",8.68,8.6999999999999993,"B9V            ","B9","V         ",302.34940065000001,33.38769448,2.3000000000000007]
["HD 227990","","*  ",null,"",302.35032960000001,"20 9 24",38.634070600000001,"+38 38 2.65",9.74,9.64,"B9V            ","B9","V         ",302.35032960000001,38.634070600000001,1.3599999999999994]
["28 Cyg","","Be*","","Be",302.35674659,"20 9 25.6",36.839622149999997,"+36 50 22.63",4.7930000000000001,4.9290000000000003,"B2.5Ve         ","B2","Ve        ",302.35674659,36.839622149999997,6.0709999999999997]
["HD 191611","","V* ","","",302.35864620000001,"20 9 26",36.488745000000002,"+36 29 19.48",8.8699999999999992,8.57,"B0.5III        ","B0","III       ",302.35864620000001,36.488745000000002,2.4299999999999997]
["V372 Sge","Var","bC*","","",302.41497521999997,"20 9 39.5",21.078782530000002,"+21 4 43.61",8.26,8.34,"B0.5III-IV     ","B0","III-IV    ",302.41497521999997,21.078782530000002,2.66]
["HD 228041","","Be*","","Be",302.49341249999998,"20 9 58.4",35.496051100000003,"+35 29 45.78",9.31,9.0399999999999991,"B0.5V:e        ","B0","V:e       ",302.49341249999998,35.496051100000003,1.9600000000000009]
["HD 191720","","*  ",null,"",302.50687334999998,"20 10 1.6",36.978464729999999,"+36 58 42.47",7.82,7.79,"B9V            ","B9","V         ",302.50687334999998,36.978464729999999,3.21]
["HD 228063","","*  ",null,"",302.54860307000001,"20 10 11.6",36.191333999999998,"+36 11 28.8",8.59,8.6,"B8V            ","B8","V         ",302.54860307000001,36.191333999999998,2.4000000000000004]
["HD 191743","","*iC",null,"",302.57345830000003,"20 10 17.6",33.5553636,"+33 33 19.3",8.8800000000000008,8.9,"B7III          ","B7","III       ",302.57345830000003,33.5553636,2.0999999999999996]
["HD 228073","","*iC",null,"",302.60392919999998,"20 10 24.9",33.802227799999997,"+33 48 8.02",9.3000000000000007,9.23,"B9V            ","B9","V         ",302.60392919999998,33.802227799999997,1.7699999999999996]
["HD 191746","","*  ","","",302.63259332000001,"20 10 31.8",28.434272669999999,"+28 26 3.38",7.1790000000000003,7.1909999999999998,"B2IV           ","B2","IV        ",302.63259332000001,28.434272669999999,3.8090000000000002]
["HD 191812","","*iC",null,"",302.64633765999997,"20 10 35.1",33.634047930000001,"+33 38 2.57",7.86,7.77,"B9V            ","B9","V         ",302.64633765999997,33.634047930000001,3.2300000000000004]
["HD 228101                ",{"$f":"IF(LEFT(A1918,2)=\"V*\",\"var\",\"\")","v":""},"*  ","","",302.65288564000002,"20 10 36.6",37.458512800000001," 37 27 30.64",8.52,8.49,"B1V            ","B1","V         ",302.65288564000002,37.458512800000001,2.5099999999999998]
["V2111 Cyg","Var","LP*","","",302.65928832999998,"20 10 38.2",33.855705989999997,"+33 51 20.54",7.58,7.63,"B3V            ","B3","V         ",302.65928832999998,33.855705989999997,3.37]
["CCDM J20106+3338BC","","** ",null,"",302.65975606000001,"20 10 38.3",33.630750409999997,"+33 37 50.7",8.4060000000000006,8.4329999999999998,"B9V            ",{"$f":"+LEFT(L1920,2)","v":"B9"},{"$f":"+IF(MID(L1920,3,1)=\".\",MID(L1920,5,10),MID(L1920,3,10))","v":"V         "},302.65975606000001,33.630750409999997,2.5670000000000002]
["HD 228114","","*  ",null,"",302.68147636999998,"20 10 43.5",37.465339899999996,"+37 27 55.22",9.0310000000000006,8.9600000000000009,"B8IV           ","B8","IV        ",302.68147636999998,37.465339899999996,2.0399999999999991]
["HD 191721","","*  ",null,"",302.68811722999999,"20 10 45.1",20.486844959999999,"+20 29 12.64",7.37,7.45,"B8V            ","B8","V         ",302.68811722999999,20.486844959999999,{"$f":"11-K1922","v":3.55}]
["HD 228110","","*iC",null,"",302.70040790000002,"20 10 48",33.718096099999997,"+33 43 5.14",9.2219999999999995,9.1989999999999998,"B7V            ","B7","V         ",{"$f":"+F1923","v":302.70040790000002},{"$f":"+H1923","v":33.718096099999997},1.8010000000000002]
["HD 351582","","Em*","Em","",302.70241829999998,"20 10 48.5",19.773895799999998,"+19 46 26.02",9.1300000000000008,9.11,"B8V            ","B8","V         ",302.70241829999998,19.773895799999998,1.8900000000000006]
["HD 228128","","*i*",null,"",302.70310799999999,"20 10 48.7",36.754539000000001,"+36 45 16.34",10.121,9.9779999999999998,"B8IV           ","B8","IV        ",302.70310799999999,36.754539000000001,1.0220000000000002]
["HD 192035","","*  ","","",302.70661870999999,"20 10 49.5",47.813110309999999,"+47 48 47.19",8.26,8.2200000000000006,"B0III-IV(n)    ","B0","III-IV(n) ",302.70661870999999,47.813110309999999,2.7799999999999994]
["HD 192575","","*  ","","",302.73713201999999,"20 10 56.9",68.272216240000006,"+68 16 19.97",6.99,6.84,"B0.5V          ","B0","V         ",302.73713201999999,68.272216240000006,4.16]
["HD 191917                ",{"$f":"IF(LEFT(A1928,2)=\"V*\",\"var\",\"\")","v":""},"*  ","","",302.73759189999998,"20 10 57",35.953167950000001," 35 57 11.4",7.86,7.79,"B1III          ","B1","III       ",302.73759189999998,35.953167950000001,3.21]
["HD 192001","","*  ","","",302.75711138999998,"20 11 1.7",42.12678124,"+42 7 36.41",8.52,8.2899999999999991,"O9.5IV           ","O9","IV        ",302.75711138999998,42.12678124,2.7100000000000009]
["HD 228147","","*  ",null,"",302.76209749999998,"20 11 2.9",34.820076899999997,"+34 49 12.27",9.31,9.3000000000000007,"B9V            ","B9","V         ",302.76209749999998,34.820076899999997,1.6999999999999993]
["HD 228171","","*  ","","",302.78671830000002,"20 11 8.8",37.6351236,"+37 38 6.44",9.1440000000000001,9.11,"B9V            ","B9","V         ",302.78671830000002,37.6351236,1.8900000000000006]
["HD 192003","","*  ","","",302.82021209999999,"20 11 16.8",38.2299972,"+38 13 47.98",8.9499999999999993,8.85,"B2IV           ","B2","IV        ",302.82021209999999,38.2299972,2.1500000000000004]
["HD 192039","","*  ","","",302.82054353000001,"20 11 16.9",41.959144119999998,"+41 57 32.91",8.9499999999999993,8.7899999999999991,"B0IV           ","B0","IV        ",302.82054353000001,41.959144119999998,2.2100000000000009]
["CCDM J20113+3550AB","","** ","","",302.82983830000001,"20 11 19.1",35.830225800000001,"+35 49 48.81",9.52,9.41,"B2III-IV       ","B2","III-IV    ",302.82983830000001,35.830225800000001,1.5899999999999999]
["HD 192079","","*i*","","",302.93746370000002,"20 11 44.9",37.549975799999999,"+37 32 59.91",9,8.77,"B0.5IV         ","B0","IV        ",302.93746370000002,37.549975799999999,2.2300000000000004]
["HD 191946","","*  ",null,"",302.94019209999999,"20 11 45.6",20.069690300000001,"+20 4 10.88",8.49,8.58,"B9V            ","B9","V         ",302.94019209999999,20.069690300000001,2.42]
["HD 192102","","*  ",null,"",302.94330880000001,"20 11 46.3",38.682818529999999,"+38 40 58.14",8.27,8.2799999999999994,"B8IV           ","B8","IV        ",302.94330880000001,38.682818529999999,2.7200000000000006]
["HD 228242","","*  ",null,"",302.959046,"20 11 50.1",39.607875,"+39 36 28.34",10.055,9.9309999999999992,"B8III          ","B8","III       ",302.959046,39.607875,1.0690000000000008]
["HD 192123","","*  ",null,"",302.96869579999998,"20 11 52.4",38.700629399999997,"+38 42 2.26",8.6,8.61,"B8IV           ","B8","IV        ",302.96869579999998,38.700629399999997,2.3900000000000006]
["HD 192043","","*iC",null,"",302.98803863000001,"20 11 57.1",26.743706289999999,"+26 44 37.34",7.51,7.6,"B8III          ","B8","III       ",302.98803863000001,26.743706289999999,3.4000000000000004]
["20 Vul","","Be*",null,"Be",303.00292202999998,"20 12 0.7",26.47880657,"+26 28 43.7",5.7969999999999997,5.9029999999999996,"B7Ve           ","B7","Ve        ",303.00292202999998,26.47880657,5.0970000000000004]
["HD 228263                ",{"$f":"IF(LEFT(A1942,2)=\"V*\",\"var\",\"\")","v":""},"*  ","","",303.01049540000002,"20 12 2.5",37.648879999999998," 37 38 55.96",9.5399999999999991,9.4499999999999993,"B1V            ","B1","V         ",303.01049540000002,37.648879999999998,1.5500000000000007]
["V2312 Cyg","Var","LP*",null,"",303.01561063000003,"20 12 3.7",47.737043679999999,"+47 44 13.35",6.8,6.9080000000000004,"B7V            ","B7","V         ",303.01561063000003,47.737043679999999,4.0919999999999996]
["V1357 Aql","Var","Ro*",null,"",303.01603352000001,"20 12 3.8",15.35781072,"+15 21 28.11",7.75,7.9,"B5.5IIIp       ","B5","IIIp      ",303.01603352000001,15.35781072,3.0999999999999996]
["V1357 Aql","Var","Ro*",null,"",303.01603352000001,"20 12 3.8",15.35781072,"+15 21 28.11",7.75,7.9,"B5.5IIIp       ","B5","IIIp      ",303.01603352000001,15.35781072,3.0999999999999996]
["HD 228250","","*  ",null,"",303.02895119999999,"20 12 6.9",34.699811099999998,"+34 41 59.31",9.66,9.64,"B9V            ","B9","V         ",303.02895119999999,34.699811099999998,1.3599999999999994]
["HD 228264","","*  ",null,"",303.03176669999999,"20 12 7.6",36.067709399999998,"+36 4 3.75",9.5150000000000006,9.468,"B9III          ","B9","III       ",303.03176669999999,36.067709399999998,1.532]
["HD 228289","","*i*","","",303.09664249999997,"20 12 23.1",38.063988299999998,"+38 3 50.35",9.9719999999999995,9.6869999999999994,"B2III:         ","B2","III:      ",303.09664249999997,38.063988299999998,1.3130000000000006]
["BD+00 4444A","","*i*",null,"",303.14637099999999,"20 12 35.1",0.86702800000000002,"+0 52 1.3",6.96,6.91,"B9spe...       ","B9","spe...    ",303.14637099999999,0.86702800000000002,4.09]
["HD 192225","","*iC",null,"",303.16592995000002,"20 12 39.8",33.495610939999999,"+33 29 44.19",8.0399999999999991,8.06,"B8III          ","B8","III       ",303.16592995000002,33.495610939999999,2.9399999999999995]
["HD 192303                ",{"$f":"IF(LEFT(A1951,2)=\"V*\",\"var\",\"\")","v":""},"*  ","","",303.19916419999998,"20 12 47.7",38.227666900000003," 38 13 39.6",9.1999999999999993,8.94,"B1III          ","B1","III       ",303.19916419999998,38.227666900000003,2.0600000000000005]
["HD 228326","","*  ","","",303.22019749999998,"20 12 52.8",36.422536399999998,"+36 25 21.13",9.58,9.4169999999999998,"B2IV           ","B2","IV        ",303.22019749999998,36.422536399999998,1.5830000000000002]
["HD 228354","","*  ",null,"",303.24147169999998,"20 12 57.9",39.790257799999999,"+39 47 24.92",9.94,9.7859999999999996,"B9V            ","B9","V         ",303.24147169999998,39.790257799999999,1.2140000000000004]
["HD 228365                ",{"$f":"IF(LEFT(A1954,2)=\"V*\",\"var\",\"\")","v":""},"*  ","","",303.25488999999999,"20 13 1.1",41.028351700000002," 41 1 42.06",10.220000000000001,9.9700000000000006,"B1V            ","B1","V         ",303.25488999999999,41.028351700000002,1.0299999999999994]
["HD 192361","","*  ",null,"",303.27007209999999,"20 13 4.8",38.4813647,"+38 28 52.91",8.77,8.77,"B8III          ","B8","III       ",303.27007209999999,38.4813647,2.2300000000000004]
["HD 192322","","*iC",null,"",303.27141080000001,"20 13 5.1",33.832761699999999,"+33 49 57.94",9.06,9.07,"B7III          ","B7","III       ",303.27141080000001,33.832761699999999,1.9299999999999997]
["HD 228348","","*  ",null,"",303.27672369999999,"20 13 6.4",35.7392453,"+35 44 21.28",9.89,9.86,"B7IV           ","B7","IV        ",303.27672369999999,35.7392453,1.1400000000000006]
["HD 192444                ",{"$f":"IF(LEFT(A1958,2)=\"V*\",\"var\",\"\")","v":""},"*  ","","",303.37088039999998,"20 13 29",38.479438299999998," 38 28 45.97",8.8800000000000008,8.43,"B1III          ","B1","III       ",303.37088039999998,38.479438299999998,2.5700000000000003]
["HD 228408","","*  ",null,"",303.3768412,"20 13 30.4",39.6913269,"+39 41 28.77",9.7799999999999994,9.8000000000000007,"B8IV           ","B8","IV        ",303.3768412,39.6913269,1.1999999999999993]
["HD 192445","","Be*","","Be",303.38745898000002,"20 13 32.9",36.328381819999997,"+36 19 42.17",7.15,7.23,"B0.5III        ","B0","III       ",303.38745898000002,36.328381819999997,3.7699999999999996]
["HD 228437","","*  ","","",303.44384960000002,"20 13 46.5",37.299995299999999,"+37 17 59.98",9.0500000000000007,8.86,"B0.5V:         ","B0","V:        ",303.44384960000002,37.299995299999999,2.1400000000000006]
["HD 228438","","Be*","","Be",303.45951539999999,"20 13 50.2",36.622925799999997,"+36 37 22.53",8.6989999999999998,8.3699999999999992,"B0.5III        ","B0","III       ",303.45951539999999,36.622925799999997,2.6300000000000008]
["HD 192599","","*  ",null,"",303.4611792,"20 13 50.6",46.117455800000002,"+46 7 2.84",8.16,8.1199999999999992,"B9V            ","B9","V         ",303.4611792,46.117455800000002,2.8800000000000008]
["HD 228452","","*  ","","",303.48943800000001,"20 13 57.4",35.403072000000002,"+35 24 11.05",10.43,9.77,"B3V            ","B3","V         ",303.48943800000001,35.403072000000002,1.2300000000000004]
["HD 192537","","*  ",null,"",303.49231170000002,"20 13 58.1",38.237044400000002,"+38 14 13.35",9.07,9.09,"B8V            ","B8","V         ",303.49231170000002,38.237044400000002,1.9100000000000001]
["HD 228450","","*i*","","",303.49592999999999,"20 13 59",36.5438744,"+36 32 37.94",9.3879999999999999,9.2479999999999993,"B0.5p          ","B0","p         ",303.49592999999999,36.5438744,1.7520000000000007]
["HD 228463                ",{"$f":"IF(LEFT(A1967,2)=\"V*\",\"var\",\"\")","v":""},"*  ","","",303.51376370000003,"20 14 3.3",37.758360600000003," 37 45 30.09",9.81,9.6,"B1V:           ","B1","V:        ",303.51376370000003,37.758360600000003,1.4000000000000004]
["HD 192516","","*iC","","",303.53880146,"20 14 9.3",33.686265650000003,"+33 41 10.55",8.6199999999999992,8.6,"B9IV           ","B9","IV        ",303.53880146,33.686265650000003,2.4000000000000004]
["HD 192539","","*  ","","",303.56707189999997,"20 14 16",31.997777500000002,"+31 59 51.99",7.38,7.2830000000000004,"B2III          ","B2","III       ",303.56707189999997,31.997777500000002,3.7169999999999996]
["HD 228483","","*  ",null,"",303.57370400000002,"20 14 17.6",38.008671999999997,"+38 0 31.21",9.7159999999999993,9.66,"B9V            ","B9","V         ",303.57370400000002,38.008671999999997,1.3399999999999999]
["HD 192517","","*  ","","",303.57744181999999,"20 14 18.5",30.177271749999999,"+30 10 38.17",6.98,7.1040000000000001,"B0.5V          ","B0","V         ",303.57744181999999,30.177271749999999,3.8959999999999999]
["HD 228471","","*  ","","",303.58219789999998,"20 14 19.7",33.4361642,"+33 26 10.19",10.55,9.94,"B2Vn           ","B2","Vn        ",303.58219789999998,33.4361642,1.0600000000000005]
["HD 228486","","*  ",null,"",303.58250620000001,"20 14 19.8",36.944268100000002,"+36 56 39.36",9.2870000000000008,9.2460000000000004,"B8III          ","B8","III       ",303.58250620000001,36.944268100000002,1.7539999999999996]
["HD 228490","","*  ",null,"",303.58616669999998,"20 14 20.6",38.485132800000002,"+38 29 6.47",9.67,9.4700000000000006,"B9V            ","B9","V         ",303.58616669999998,38.485132800000002,1.5299999999999994]
["CCDM J20144+4206AB","","** ",null,"",303.58974024999998,"20 14 21.5",42.10434008,"+42 6 15.62",6.74,6.79,"B9IV-V         ","B9","IV-V      ",303.58974024999998,42.10434008,4.21]
["HD 192584","","*  ",null,"",303.59094870000001,"20 14 21.8",34.884532800000002,"+34 53 4.31",8.86,8.8699999999999992,"B8V            ","B8","V         ",303.59094870000001,34.884532800000002,2.1300000000000008]
["HD 192604","","V* ",null,"",303.59682579999998,"20 14 23.2",35.938428899999998,"+35 56 18.34",9.09,9.08,"B8V            ","B8","V         ",303.59682579999998,35.938428899999998,1.92]
["HD 192605","","*  ",null,"",303.60517189000001,"20 14 25.2",35.622317049999999,"+35 37 20.34",8.68,8.7100000000000009,"B9V            ","B9","V         ",303.60517189000001,35.622317049999999,2.2899999999999991]
["HD 192606","","*i*",null,"",303.60762369999998,"20 14 25.8",35.407132500000003,"+35 24 25.67",8.48,8.49,"B7V            ","B7","V         ",303.60762369999998,35.407132500000003,2.5099999999999998]
["HD 228519","","*  ","","",303.65798039999999,"20 14 37.9",38.924794200000001,"+38 55 29.25",9.57,9.44,"B0.5III        ","B0","III       ",303.65798039999999,38.924794200000001,1.5600000000000005]
["HD 228521","","*  ",null,"",303.66077039999999,"20 14 38.5",38.2002314,"+38 12 0.83",9.89,9.8239999999999998,"B9V            ","B9","V         ",303.66077039999999,38.2002314,1.1760000000000002]
["BD+36 3955C              ",{"$f":"IF(LEFT(A1982,2)=\"V*\",\"var\",\"\")","v":""},"*i*","","",303.66083830000002,"20 14 38.6",36.861558600000002," 36 51 41.61",10.41,9.93,"B1III          ","B1","III       ",303.66083830000002,36.861558600000002,1.0700000000000003]
["HD 228552","","*  ",null,"",303.78108420000001,"20 15 7.4",37.64076,"+37 38 26.73",10.000999999999999,9.9600000000000009,"B9V            ","B9","V         ",303.78108420000001,37.64076,1.0399999999999991]
["HD 192766","","*  ",null,"",303.80174840000001,"20 15 12.4",38.608794330000002,"+38 36 31.65",7.99,7.99,"B9IV           ",{"$f":"+LEFT(L1984,2)","v":"B9"},{"$f":"+IF(MID(L1984,3,1)=\".\",MID(L1984,5,10),MID(L1984,3,10))","v":"IV        "},303.80174840000001,38.608794330000002,3.01]
["HR 7739","","Be*",null,"Be",303.81623093000002,"20 15 15.8",25.5919597,"+25 35 31.05",4.5919999999999996,4.7590000000000003,"B3V            ","B3","V         ",303.81623093000002,25.5919597,6.2409999999999997]
["HD 228579","","*  ",null,"",303.86095119999999,"20 15 26.6",35.021202500000001,"+35 1 16.32",10.081,9.99,"B8V            ","B8","V         ",303.86095119999999,35.021202500000001,{"$f":"11-K1986","v":1.0099999999999998}]
["HD 228602                ",{"$f":"IF(LEFT(A1987,2)=\"V*\",\"var\",\"\")","v":""},"*  ","","",303.89398119999998,"20 15 34.5",36.8318358," 36 49 54.6",10.5,9.9,"B1III          ","B1","III       ",{"$f":"+F1987","v":303.89398119999998},{"$f":"+H1987","v":36.8318358},1.0999999999999996]
["HD 228615","","*  ",null,"",303.90461420000003,"20 15 37.1",39.622004699999998,"+39 37 19.21",9.5640000000000001,9.5229999999999997,"B8III          ","B8","III       ",303.90461420000003,39.622004699999998,1.4770000000000003]
["HD 228657","","*iC",null,"",304.02310210000002,"20 16 5.5",37.630558899999997,"+37 37 50.01",9.36,9.35,"B8V            ","B8","V         ",304.02310210000002,37.630558899999997,1.6500000000000004]
["HD 192968                ",{"$f":"IF(LEFT(A1990,2)=\"V*\",\"var\",\"\")","v":""},"*  ","","",304.05758311,"20 16 13.8",40.963349919999999," 40 57 48.05",7.84,7.86,"B1Vn           ","B1","Vn        ",304.05758311,40.963349919999999,3.1399999999999997]
["HR 7757","","Em*","Em","",304.11731020000002,"20 16 28.1",37.056395690000002,"+37 3 23.02",6.3639999999999999,6.4589999999999996,"B6III          ","B6","III       ",304.11731020000002,37.056395690000002,4.5410000000000004]
["HD 228690","","*  ","","",304.12175209999998,"20 16 29.2",37.922556899999996,"+37 55 21.2",9.49,9.2899999999999991,"B0.5V          ","B0","V         ",304.12175209999998,37.922556899999996,1.7100000000000009]
["BD+37 3859               ",{"$f":"IF(LEFT(A1993,2)=\"V*\",\"var\",\"\")","v":""},"*i*","","",304.12434200000001,"20 16 29.8",37.643160999999999," 37 38 35.37",9.94,9.69,"B1IV           ","B1","IV        ",304.12434200000001,37.643160999999999,1.3100000000000005]
["BD+37 3862","","*i*","","",304.13515799999999,"20 16 32.4",37.644969000000003,"+37 38 41.88",9.3699999999999992,8.9,"B0V            ","B0","V         ",304.13515799999999,37.644969000000003,2.0999999999999996]
["HD 228699","","*iC","","",304.15306290000001,"20 16 36.7",37.6868944,"+37 41 12.81",9.86,9.4600000000000009,"B0.5III        ","B0","III       ",304.15306290000001,37.6868944,1.5399999999999991]
["HD 192990","","*  ",null,"",304.16565292000001,"20 16 39.7",35.468474739999998,"+35 28 6.5",7.0949999999999998,7.1130000000000004,"B9IV           ","B9","IV        ",304.16565292000001,35.468474739999998,3.8869999999999996]
["HD 193032","","V* ","","",304.16834392999999,"20 16 40.4",38.899295549999998,"+38 53 57.46",8.6199999999999992,8.35,"B0III          ","B0","III       ",304.16834392999999,38.899295549999998,2.6500000000000004]
["HD 193009                ",{"$f":"IF(LEFT(A1998,2)=\"V*\",\"var\",\"\")","v":""},"Be*","","Be",304.20075751000002,"20 16 48.1",32.379831449999998," 32 22 47.39",7.25,7.16,"B1V:nnpe       ","B1","V:nnpe    ",304.20075751000002,32.379831449999998,3.84]
["IDS 20132+3923","","** ",null,"",304.20221851999997,"20 16 48.5",39.697321930000001,"+39 41 50.35",7.68,7.73,"B9V            ","B9","V         ",304.20221851999997,39.697321930000001,3.2699999999999996]
["HD 228791","","*i*",null,"",304.42933420000003,"20 17 43",38.602886900000001,"+38 36 10.39",9.08,9.0399999999999991,"B6IV           ","B6","IV        ",304.42933420000003,38.602886900000001,1.9600000000000009]
["HD 228807","","*  ",null,"",304.49809959999999,"20 17 59.5",38.426034399999999,"+38 25 33.72",9.0399999999999991,8.98,"B5IV            ","B5","IV        ",304.49809959999999,38.426034399999999,2.0199999999999996]
["HD 228807","","*  ",null,"",304.49809959999999,"20 17 59.5",38.426034399999999,"+38 25 33.72",9.0399999999999991,8.98,"B5IV            ","B5","IV        ",304.49809959999999,38.426034399999999,2.0199999999999996]
["HD 228822","","*  ",null,"",304.51935539999999,"20 18 4.6",39.942304200000002,"+39 56 32.29",9.2010000000000005,9.1440000000000001,"B9V            ","B9","V         ",304.51935539999999,39.942304200000002,1.8559999999999999]
["HD 193324","","*  ",null,"",304.5517767,"20 18 12.4",39.569698099999997,"+39 34 10.91",8.69,8.68,"B8V            ","B8","V         ",304.5517767,39.569698099999997,2.3200000000000003]
["HD 193220","","*i*","","",304.5710717,"20 18 17",25.64825416,"+25 38 53.71",6.8310000000000004,6.9740000000000002,"B1.5V          ","B1","V         ",304.5710717,25.64825416,4.0259999999999998]
["HD 193344","","*  ",null,"",304.61484482999998,"20 18 27.5",36.254342170000001,"+36 15 15.63",7.54,7.6,"B9p            ","B9","p         ",304.61484482999998,36.254342170000001,3.4000000000000004]
["HD 193427                ",{"$f":"IF(LEFT(A2007,2)=\"V*\",\"var\",\"\")","v":""},"*i*","","",304.68817790000003,"20 18 45.1",39.406223599999997," 39 24 22.4",9.61,9.26,"B1V            ","B1","V         ",304.68817790000003,39.406223599999997,1.7400000000000002]
["V1773 Cyg","Var","El*","","",304.70694860999998,"20 18 49.6",46.32219362,"+46 19 19.89",6.3259999999999996,6.4480000000000004,"B2V            ","B2","V         ",304.70694860999998,46.32219362,4.5519999999999996]
["HD 228860","","Be*","","Be",304.71479499999998,"20 18 51.5",36.9613722,"+36 57 40.93",10.220000000000001,9.7200000000000006,"B0.5IV         ","B0","IV        ",304.71479499999998,36.9613722,1.2799999999999994]
["HD 228875                ",{"$f":"IF(LEFT(A2010,2)=\"V*\",\"var\",\"\")","v":""},"*  ","","",304.72180209999999,"20 18 53.2",39.752682200000002," 39 45 9.65",9.77,9.4600000000000009,"B1III          ","B1","III       ",304.72180209999999,39.752682200000002,1.5399999999999991]
["HD 193444","","*  ","","",304.72295000000003,"20 18 53.5",37.842717800000003,"+37 50 33.78",8.8800000000000008,8.4700000000000006,"B0.5V          ","B0","V         ",304.72295000000003,37.842717800000003,2.5299999999999994]
["HD 228886","","*  ","","",304.76821630000001,"20 19 4.3",37.3988528,"+37 23 55.87",10.4,9.6999999999999993,"B0.5III:       ","B0","III:      ",304.76821630000001,37.3988528,1.3000000000000007]
["HD 193594","","*  ",null,"",304.83620417999998,"20 19 20.6",41.391397060000003,"+41 23 29.02",7.79,7.79,"B9V            ","B9","V         ",304.83620417999998,41.391397060000003,3.21]
["HD 228919                ",{"$f":"IF(LEFT(A2014,2)=\"V*\",\"var\",\"\")","v":""},"*  ","","",304.86628330000002,"20 19 27.9",40.461694199999997," 40 27 42.09",10.210000000000001,9.75,"B1IV           ","B1","IV        ",304.86628330000002,40.461694199999997,1.25]
["BD+38 4008","","*iC","","",304.87918710000002,"20 19 31",38.818919700000002,"+38 49 8.11",10.220000000000001,9.7799999999999994,"B0.5V          ","B0","V         ",304.87918710000002,38.818919700000002,1.2200000000000006]
["DE Dra","Var","Al*",null,"",304.90300107000002,"20 19 36.7",62.257471389999999,"+62 15 26.89",5.6669999999999998,5.7119999999999997,"B9V            ","B9","V         ",304.90300107000002,62.257471389999999,5.2880000000000003]
["HD 228913","","*  ","","",304.9051867,"20 19 37.2",36.217123100000002,"+36 13 1.64",10.53,9.98,"B0.5III:nn     ","B0","III:nn    ",304.9051867,36.217123100000002,1.0199999999999996]
["V478 Cyg","Var","Al*","","",304.91144902999997,"20 19 38.7",38.335889569999999,"+38 20 9.2",9.16,8.68,"B0V+...        ","B0","V+...     ",304.91144902999997,38.335889569999999,2.3200000000000003]
["HD 193633","","*i*",null,"",304.9370108,"20 19 44.8",41.138515300000002,"+41 8 18.65",7.2119999999999997,7.1820000000000004,"B9V            ","B9","V         ",304.9370108,41.138515300000002,3.8179999999999996]
["HD 193634","","*  ","","",304.95492902000001,"20 19 49.1",38.34271451,"+38 20 33.77",7.66,7.423,"B3III          ","B3","III       ",304.95492902000001,38.34271451,3.577]
["HD 193666","","*  ",null,"",304.97646453999999,"20 19 54.3",41.602382650000003,"+41 36 8.57",8.1199999999999992,8.1300000000000008,"B8V            ","B8","V         ",304.97646453999999,41.602382650000003,2.8699999999999992]
["V1584 Cyg","Var","a2*",null,"",304.98350971000002,"20 19 56",46.837317570000003,"+46 50 14.34",6.3970000000000002,6.48,"B9sp...        ","B9","sp...     ",304.98350971000002,46.837317570000003,4.5199999999999996]
["HD 193491","","*  ",null,"",305.04034460000003,"20 20 9.6",10.2230144,"+10 13 22.85",9.08,9.01,"B9V            ","B9","V         ",305.04034460000003,10.2230144,1.9900000000000002]
["HD 193681","","*iC",null,"",305.04290709999998,"20 20 10.2",38.833506100000001,"+38 50 0.62",8.2409999999999997,8.24,"B9V            ","B9","V         ",305.04290709999998,38.833506100000001,2.76]
["HD 228997","","*  ","","",305.10175329999998,"20 20 24.4",39.628621899999999,"+39 37 43.03",9.0229999999999997,9.0269999999999992,"B9III          ","B9","III       ",305.10175329999998,39.628621899999999,1.9730000000000008]
["HD 193794","","*i*","","",305.18741080000001,"20 20 44.9",39.365727800000002,"+39 21 56.62",9.68,9.08,"B0V            ","B0","V         ",305.18741080000001,39.365727800000002,1.92]
["HD 193814","","*  ",null,"",305.20142628999997,"20 20 48.3",38.25644432,"+38 15 23.19",7.51,7.59,"B8V            ","B8","V         ",305.20142628999997,38.25644432,3.41]
["HD 229027","","*  ","","",305.20534670000001,"20 20 49.2",39.614334399999997,"+39 36 51.6",9.59,9.49,"B9V            ","B9","V         ",305.20534670000001,39.614334399999997,1.5099999999999998]
["HD 229033","","V* ","","",305.23091119999998,"20 20 55.4",37.732109999999999,"+37 43 55.59",9.43,8.82,"B0II-III       ","B0","II-III    ",305.23091119999998,37.732109999999999,2.1799999999999997]
["HD 229049","","*  ","","",305.25561920000001,"20 21 1.3",39.014458300000001,"+39 0 52.04",10.039999999999999,9.67,"B2III:p        ","B2","III:p     ",305.25561920000001,39.014458300000001,1.33]
["BD+45 3149               ",{"$f":"IF(LEFT(A2031,2)=\"V*\",\"var\",\"\")","v":""},"*  ","","",305.27655499999997,"20 21 6.3",46.052401699999997," 46 3 8.64",9.74,9.4600000000000009,"B1V            ","B1","V         ",305.27655499999997,46.052401699999997,1.5399999999999991]
["HD 193855","","*  ","","",305.28142102999999,"20 21 7.5",39.031574429999999,"+39 1 53.66",7.96,7.77,"B2III          ","B2","III       ",305.28142102999999,39.031574429999999,3.2300000000000004]
["HD 229068","","*  ",null,"",305.32649249999997,"20 21 18.3",39.354004199999999,"+39 21 14.41",10.050000000000001,9.9600000000000009,"B9V            ","B9","V         ",305.32649249999997,39.354004199999999,1.0399999999999991]
["HD 193945","","*iC","","",305.3575937,"20 21 25.8",41.194321700000003,"+41 11 39.55",9.1,8.59,"B0Vnn          ","B0","Vnn       ",305.3575937,41.194321700000003,2.41]
["25 Vul","","Be*",null,"Be",305.51429342,"20 22 3.4",24.446099270000001,"+24 26 45.95",5.431,5.5190000000000001,"B8IIIne        ","B8","IIIne     ",305.51429342,24.446099270000001,5.4809999999999999]
["HD 194092","","*iC","","",305.52268112000002,"20 22 5.4",40.985601860000003,"+40 59 8.16",8.3699999999999992,8.2799999999999994,"B0.5III        ","B0","III       ",305.52268112000002,40.985601860000003,2.7200000000000006]
["HD 194094","","*iC","","",305.58732959999998,"20 22 20.9",38.724857800000002,"+38 43 29.48",9.52,9.07,"B0V            ","B0","V         ",305.58732959999998,38.724857800000002,1.9299999999999997]
["HD 229146","","*  ",null,"",305.62436000000002,"20 22 29.8",39.255912799999997,"+39 15 21.28",9.6999999999999993,9.59,"B8V            ","B8","V         ",305.62436000000002,39.255912799999997,1.4100000000000001]
["HD 194194","","*iC","","",305.68650057000002,"20 22 44.7",40.714621260000001,"+40 42 52.63",8.16,8.1300000000000008,"B2III          ","B2","III       ",305.68650057000002,40.714621260000001,2.8699999999999992]
["BD+63 1621B","","*i*",null,"",305.72581200000002,"20 22 54.1",64.184106,"+64 11 2.78",10.06,9.94,"B7V            ","B7","V         ",305.72581200000002,64.184106,1.0600000000000005]
["ADS 13813 AB","","** ",null,"",305.72633913999999,"20 22 54.3",64.182935689999994,"+64 10 58.56",8.9,8.9,"B9V...         ","B9","V...      ",305.72633913999999,64.182935689999994,2.0999999999999996]
["HD 194206","","*i*",null,"",305.74022395999998,"20 22 57.6",39.21103506,"+39 12 39.72",6.6349999999999998,6.7229999999999999,"B8V            ","B8","V         ",305.74022395999998,39.21103506,4.2770000000000001]
["HD 194205","","*  ","","",305.75623250000001,"20 23 1.4",39.344596899999999,"+39 20 40.54",9.5299999999999994,9.08,"B2III          ","B2","III       ",305.75623250000001,39.344596899999999,1.92]
["HD 229171","","Be*","","Be",305.76198670000002,"20 23 2.8",38.455790800000003,"+38 27 20.84",9.81,9.3800000000000008,"B0.5III:n      ","B0","III:n     ",305.76198670000002,38.455790800000003,1.6199999999999992]
["HD 194207","","*iC",null,"",305.76985880000001,"20 23 4.7",38.754369199999999,"+38 45 15.72",9.0500000000000007,9.0500000000000007,"B9V            ","B9","V         ",305.76985880000001,38.754369199999999,1.9499999999999993]
["HD 194210","","*  ",null,"",305.87905669999998,"20 23 30.9",25.848761100000001,"+25 50 55.53",9.0299999999999994,9.0399999999999991,"B9III          ","B9","III       ",305.87905669999998,25.848761100000001,1.9600000000000009]
["HR 7807","","Be*","","Be",305.93487247000002,"20 23 44.3",37.476448220000002,"+37 28 35.21",5.6890000000000001,5.859,"B2Vne          ","B2","Vne       ",305.93487247000002,37.476448220000002,5.141]
["HD 194357","","*  ",null,"",305.95015731000001,"20 23 48",37.026136979999997,"+37 1 34.09",6.93,6.83,"B9III          ",{"$f":"+LEFT(L2048,2)","v":"B9"},{"$f":"+IF(MID(L2048,3,1)=\".\",MID(L2048,5,10),MID(L2048,3,10))","v":"III       "},305.95015731000001,37.026136979999997,4.17]
["HD 229234","","*iC","","",306.00541329999999,"20 24 1.2",38.513767799999997,"+38 30 49.56",9.52,8.91,"O9.5III          ","O9","III       ",306.00541329999999,38.513767799999997,2.09]
["HD 194424","","*  ",null,"",306.01170852000001,"20 24 2.8",39.54151461,"+39 32 29.45",7.78,7.83,"B8IV           ","B8","IV        ",306.01170852000001,39.54151461,{"$f":"11-K2050","v":3.17}]
["HD 229240","","*  ",null,"",306.0182317,"20 24 4.3",37.748136100000004,"+37 44 53.28",9.5549999999999997,9.5660000000000007,"B9V            ","B9","V         ",{"$f":"+F2051","v":306.0182317},{"$f":"+H2051","v":37.748136100000004},1.4339999999999993]
["BD+41 3731","","Be*","","Be",306.06548167,"20 24 15.7",42.300379569999997,"+42 18 1.36",9.89,9.84,"B3n            ","B3","n         ",306.06548167,42.300379569999997,1.1600000000000001]
["HD 194467","","*  ",null,"",306.07527027999998,"20 24 18",37.575433050000001,"+37 34 31.55",8.02,8.06,"B9V            ","B9","V         ",306.07527027999998,37.575433050000001,2.9399999999999995]
["HD 194466","","*iC",null,"",306.07700080000001,"20 24 18.4",38.185056400000001,"+38 11 6.2",8.99,8.86,"B8III          ","B8","III       ",306.07700080000001,38.185056400000001,2.1400000000000006]
["HR 7803","","V* ",null,"",306.15624358000002,"20 24 37.4",1.06840534,"+1 4 6.25",6.1070000000000002,6.1440000000000001,"B9V            ","B9","V         ",306.15624358000002,1.06840534,4.8559999999999999]
["BD+41 3737","","*i*","","",306.1942962,"20 24 46.6",42.384803099999999,"+42 23 5.29",9.34,9.27,"B3Vn           ","B3","Vn        ",306.1942962,42.384803099999999,1.7300000000000004]
["HD 194576","","*  ",null,"",306.24495100000001,"20 24 58.7",39.839367600000003,"+39 50 21.72",8.61,8.66,"B8III          ","B8","III       ",306.24495100000001,39.839367600000003,2.34]
["V399 Vul","Var","Al*","","",306.29501469000002,"20 25 10.8",21.488565690000001,"+21 29 18.83",6.96,7.06,"B3IV-VB4V      ","B3","IV-VB4V   ",306.29501469000002,21.488565690000001,3.9400000000000004]
["HD 194670","","*  ",null,"",306.36908256999999,"20 25 28.5",39.793521210000002,"+39 47 36.67",7.4610000000000003,7.5369999999999999,"B8V            ","B8","V         ",306.36908256999999,39.793521210000002,3.4630000000000001]
["HD 194883","","Be*","","Be",306.38671079,"20 25 32.8",54.684200959999998,"+54 41 3.12",7.32,7.36,"B2Ve           ","B2","Ve        ",306.38671079,54.684200959999998,3.6399999999999997]
["V455 Cyg","Var","bL*","","",306.58717369999999,"20 26 20.9",39.669465799999998,"+39 40 10.07",10.42,9.51,"B2pe...        ","B2","pe...     ",306.58717369999999,39.669465799999998,1.4900000000000002]
["HR 7827","","*i*",null,"",306.59781634000001,"20 26 23.4",56.638697319999999,"+56 38 19.31",6.39,6.3739999999999997,"B9V            ","B9","V         ",306.59781634000001,56.638697319999999,4.6260000000000003]
["HD 194739","","*  ","","",306.75889864999999,"20 27 2.1",9.0921514999999999,"+9 5 31.74",7.41,7.54,"B2.5V          ","B2","V         ",306.75889864999999,9.0921514999999999,3.46]
["HD 195089","","*  ","","",306.90321807999999,"20 27 36.7",42.035414860000003,"+42 2 7.49",7.3,7.3339999999999996,"B2IV           ","B2","IV        ",306.90321807999999,42.035414860000003,3.6660000000000004]
["BD+40 4185","","*  ","","",307.06445869999999,"20 28 15.4",40.638838900000003,"+40 38 19.82",10.54,9.84,"B0V:           ","B0","V:        ",307.06445869999999,40.638838900000003,1.1600000000000001]
["HR 7843","","*  ",null,"",307.36296197000001,"20 29 27.1",56.068189240000002,"+56 4 5.48",5.8380000000000001,5.8890000000000002,"B9Vne          ","B9","Vne       ",307.36296197000001,56.068189240000002,5.1109999999999998]
["HD 195406","","*i*",null,"",307.42989999000002,"20 29 43.1",38.125456679999999,"+38 7 31.64",8.09,8.15,"B6V            ","B6","V         ",307.42989999000002,38.125456679999999,2.8499999999999996]
["BD+37 3952B","","*i*",null,"",307.43305136999999,"20 29 43.9",38.129489169999999,"+38 7 46.16",8.41,8.4499999999999993,"B9IV           ","B9","IV        ",307.43305136999999,38.129489169999999,2.5500000000000007]
["HD 195407","","Be*","","Be",307.44901541000002,"20 29 47.7",36.980380830000001,"+36 58 49.37",8.1300000000000008,7.8,"B0IV:pe        ","B0","IV:pe     ",307.44901541000002,36.980380830000001,3.2]
["V2014 Cyg","Var","bC*","","",307.51475482000001,"20 30 3.5",48.951567939999997,"+48 57 5.64",4.8490000000000002,4.9379999999999997,"B2.5IV         ","B2","IV        ",307.51475482000001,48.951567939999997,6.0620000000000003]
["HD 195629","","*  ",null,"",307.76153362000002,"20 31 2.7",40.426562760000003,"+40 25 35.62",7.52,7.6,"B9V            ","B9","V         ",307.76153362000002,40.426562760000003,3.4000000000000004]
["HR 7840","","*i*",null,"",307.80442464999999,"20 31 13",11.26058733,"+11 15 38.11",7.14,7.11,"B8V            ","B8","V         ",307.80442464999999,11.26058733,3.8899999999999997]
["HD 195965","","*  ","","",308.10662373000002,"20 32 25.5",48.216476460000003,"+48 12 59.31",6.9050000000000002,6.98,"B0V            ","B0","V         ",308.10662373000002,48.216476460000003,4.0199999999999996]
["HR 7861","","*  ",null,"",308.21803520999998,"20 32 52.3",43.191571400000001,"+43 11 29.65",6.484,6.5940000000000003,"B4III          ","B4","III       ",308.21803520999998,43.191571400000001,4.4059999999999997]
["HD 195907","","Be*","","Be",308.27130602,"20 33 5.1",31.65703122,"+31 39 25.31",7.85,7.82,"B1.5V          ","B1","V         ",308.27130602,31.65703122,3.1799999999999997]
["eps Del","","V* ",null,"",308.30321633,"20 33 12.7",11.30326144,"+11 18 11.74",3.92,4.032,"B6III          ","B6","III       ",308.30321633,11.30326144,6.968]
["HD 196006","","*  ","","",308.37661967000003,"20 33 30.3",32.907717480000002,"+32 54 27.78",7.173,7.3090000000000002,"B2V            ","B2","V         ",308.37661967000003,32.907717480000002,3.6909999999999998]
["V2015 Cyg","Var","a2*",null,"",308.47851701000002,"20 33 54.8",46.693865189999997,"+46 41 37.91",5.6310000000000002,5.7670000000000003,"B9sp...        ","B9","sp...     ",308.47851701000002,46.693865189999997,5.2329999999999997]
["HR 7862","","*  ","","",308.54159490000001,"20 34 9.9",20.985185690000002,"+20 59 6.66",6.33,6.4729999999999999,"B3IV           ","B3","IV        ",308.54159490000001,20.985185690000002,4.5270000000000001]
["HD 196025","","*  ","","",308.63254115000001,"20 34 31.8",6.8780915599999997,"+6 52 41.12",6.88,6.99,"B2IV-V         ","B2","IV-V      ",308.63254115000001,6.8780915599999997,4.01]
["HD 196421","","*  ","","",308.63905392999999,"20 34 33.3",57.927904650000002,"+57 55 40.45",8.15,8.08,"B2IV           ","B2","IV        ",308.63905392999999,57.927904650000002,2.92]
["HD 197053","","*  ",null,"",309.26698887999999,"20 37 4",67.504290780000005,"+67 30 15.44",7.65,7.7,"B9V            ","B9","V         ",309.26698887999999,67.504290780000005,3.3]
["27 Vul","","*  ",null,"",309.26946889999999,"20 37 4.6",26.461946869999998,"+26 27 43",5.5389999999999997,5.5890000000000004,"B9V            ","B9","V         ",309.26946889999999,26.461946869999998,5.4109999999999996]
["BD+45 3230","","*  ","","",309.30512393999999,"20 37 13.2",46.138843940000001,"+46 8 19.83",10.06,9.4,"B0III          ","B0","III       ",309.30512393999999,46.138843940000001,1.5999999999999996]
["HR 7878","","*  ",null,"",309.32658723999998,"20 37 18.3",9.6974190000000002E-2,"+0 5 49.1",6.1189999999999998,6.2060000000000004,"B8IIIp         ","B8","IIIp      ",309.32658723999998,9.6974190000000002E-2,4.7939999999999996]
["48 Cyg","","*i*",null,"",309.38240903000002,"20 37 31.7",31.572540870000001,"+31 34 21.14",6.2229999999999999,6.3079999999999998,"B8IIIn         ","B8","IIIn      ",309.38240903000002,31.572540870000001,4.6920000000000002]
["HD 235298","","*  ","","",309.44372425,"20 37 46.4",51.46545356,"+51 27 55.63",8.4499999999999993,8.4499999999999993,"B3V            ","B3","V         ",309.44372425,51.46545356,2.5500000000000007]
["28 Vul","","*  ",null,"",309.63297564999999,"20 38 31.9",24.11595814,"+24 6 57.44",4.9169999999999998,5.0469999999999997,"B5IV            ","B5","IV        ",309.63297564999999,24.11595814,5.9530000000000003]
["28 Vul","","*  ",null,"",309.63297564999999,"20 38 31.9",24.11595814,"+24 6 57.44",4.9169999999999998,5.0469999999999997,"B5IV            ","B5","IV        ",309.63297564999999,24.11595814,5.9530000000000003]
["HR 7899","","*i*","","",309.77070080999999,"20 39 4.9",15.838200179999999,"+15 50 17.52",5.82,5.98,"B3V            ","B3","V         ",309.77070080999999,15.838200179999999,5.0199999999999996]
["HR 7912","","*  ",null,"",309.84637164999998,"20 39 23.1",45.66691247,"+45 40 0.88",6.5410000000000004,6.6139999999999999,"B5IV            ","B5","IV        ",309.84637164999998,45.66691247,4.3860000000000001]
["HR 7912","","*  ",null,"",309.84637164999998,"20 39 23.1",45.66691247,"+45 40 0.88",6.5410000000000004,6.6139999999999999,"B5IV            ","B5","IV        ",309.84637164999998,45.66691247,4.3860000000000001]
["V2130 Cyg","Var","Ro*",null,"",309.88881695999999,"20 39 33.3",40.579660560000001,"+40 34 46.77",5.9640000000000004,6.0949999999999998,"B6IIImnp       ","B6","IIImnp    ",309.88881695999999,40.579660560000001,4.9050000000000002]
["alf Del","","*i*","","",309.90953000000002,"20 39 38.2",15.91207326,"+15 54 43.46",3.74,3.8,"B9IV           ","B9","IV        ",309.90953000000002,15.91207326,7.2]
["HD 197167","","*  ",null,"",310.07321669999999,"20 40 17.5",45.571850599999998,"+45 34 18.66",8.2899999999999991,8.31,"B8III          ","B8","III       ",310.07321669999999,45.571850599999998,2.6899999999999995]
["BD+45 3239","","*  ",null,"",310.24560000000002,"20 40 58.9",45.783111099999999,"+45 46 59.19",8.82,8.7100000000000009,"B6III          ","B6","III       ",310.24560000000002,45.783111099999999,2.2899999999999991]
["HR 7922","","*i*",null,"",310.25151713000002,"20 41 0.3",39.082323209999998,"+39 4 56.36",6.39,6.4930000000000003,"B6III          ","B6","III       ",310.25151713000002,39.082323209999998,4.5069999999999997]
["HD 197374","","*i*",null,"",310.40444794000001,"20 41 37",43.836752629999999,"+43 50 12.3",8.2799999999999994,8.35,"B9V            ","B9","V         ",310.40444794000001,43.836752629999999,2.6500000000000004]
["HD 197391","","*  ",null,"",310.4142708,"20 41 39.4",44.645611700000003,"+44 38 44.2",9.1199999999999992,9.07,"B8V            ","B8","V         ",310.4142708,44.645611700000003,1.9299999999999997]
["BD+45 3242","","*  ",null,"",310.4588129,"20 41 50.1",46.010555799999999,"+46 0 38",8.99,8.9700000000000006,"B5V             ","B5","V         ",310.4588129,46.010555799999999,2.0299999999999994]
["BD+45 3242","","*  ",null,"",310.4588129,"20 41 50.1",46.010555799999999,"+46 0 38",8.99,8.9700000000000006,"B5V             ","B5","V         ",310.4588129,46.010555799999999,2.0299999999999994]
["HR 7926","","*  ",null,"",310.48542178000002,"20 41 56.5",41.716875440000003,"+41 43 0.75",5.5620000000000003,5.6660000000000004,"B8II-III       ","B8","II-III    ",310.48542178000002,41.716875440000003,5.3339999999999996]
["HD 197512                ",{"$f":"IF(LEFT(A2103,2)=\"V*\",\"var\",\"\")","v":""},"*  ","","",310.54187156,"20 42 10",49.734739769999997," 49 44 5.06",8.6,8.5500000000000007,"B1V            ","B1","V         ",310.54187156,49.734739769999997,2.4499999999999993]
["51 Cyg","","*  ","","",310.55261824000002,"20 42 12.6",50.340025199999999,"+50 20 24.09",5.298,5.4039999999999999,"B2V            ","B2","V         ",310.55261824000002,50.340025199999999,5.5960000000000001]
["HR 7927","","Be*","","Be",310.59301391000002,"20 42 22.3",35.456195430000001,"+35 27 22.3",6.5170000000000003,6.6710000000000003,"B2IV-Ve        ","B2","IV-Ve     ",310.59301391000002,35.456195430000001,4.3289999999999997]
["BD+45 3246               ",{"$f":"IF(LEFT(A2106,2)=\"V*\",\"var\",\"\")","v":""},"*  ","","",310.62921419999998,"20 42 31",45.901262500000001," 45 54 4.54",9.83,9.7200000000000006,"B1Vn           ","B1","Vn        ",310.62921419999998,45.901262500000001,1.2799999999999994]
["HD 197619","","*  ",null,"",310.67605749000001,"20 42 42.2",52.630554660000001,"+52 37 49.99",8.5399999999999991,8.4499999999999993,"B9V            ","B9","V         ",310.67605749000001,52.630554660000001,2.5500000000000007]
["HD 235330","","*  ",null,"",310.71218316,"20 42 50.9",53.166624650000003,"+53 9 59.84",10.18,9.99,"B8V            ","B8","V         ",310.71218316,53.166624650000003,1.0099999999999998]
["BD+45 3247","","*  ",null,"",310.76656200000002,"20 43 3.9",45.836849999999998,"+45 50 12.65",9.44,9.39,"B9V            ","B9","V         ",310.76656200000002,45.836849999999998,1.6099999999999994]
["V379 Cep","Var","Al*","","",310.80701267000001,"20 43 13.6",57.113996159999999,"+57 6 50.38",6.5940000000000003,6.3410000000000002,"B2III          ","B2","III       ",310.80701267000001,57.113996159999999,4.6589999999999998]
["BD+43 3701","","*  ",null,"",311.09360182,"20 44 22.4",43.959365640000001,"+43 57 33.71",9.01,9,"B9V            ","B9","V         ",311.09360182,43.959365640000001,2]
["HD 197702                ",{"$f":"IF(LEFT(A2112,2)=\"V*\",\"var\",\"\")","v":""},"*  ","","",311.11081490999999,"20 44 26.5",31.695763660000001," 31 41 44.74",8.0559999999999992,7.9409999999999998,"B1IIIn...      ",{"$f":"+LEFT(L2112,2)","v":"B1"},{"$f":"+IF(MID(L2112,3,1)=\".\",MID(L2112,5,10),MID(L2112,3,10))","v":"IIIn...   "},311.11081490999999,31.695763660000001,3.0590000000000002]
["HD 235347","","*  ",null,"",311.13036532000001,"20 44 31.2",51.031190260000002,"+51 1 52.28",9.0299999999999994,8.9600000000000009,"B9V            ","B9","V         ",311.13036532000001,51.031190260000002,2.0399999999999991]
["BD+45 3256","","*  ",null,"",311.27625799999998,"20 45 6.3",45.754711,"+45 45 16.95",9.01,9.02,"B8V            ","B8","V         ",311.27625799999998,45.754711,{"$f":"11-K2114","v":1.9800000000000004}]
["HD 235350","","*  ","","",311.29417007000001,"20 45 10.6",51.210551369999997,"+51 12 37.98",9.48,9.31,"B0.5IV         ","B0","IV        ",{"$f":"+F2115","v":311.29417007000001},{"$f":"+H2115","v":51.210551369999997},1.6899999999999995]
["HD 235352","","*  ",null,"",311.37402459999998,"20 45 29.7",50.779973300000002,"+50 46 47.9",9.91,9.69,"B8V            ","B8","V         ",311.37402459999998,50.779973300000002,1.3100000000000005]
["BD+45 3264","","*  ",null,"",311.46806199999997,"20 45 52.3",45.779850000000003,"+45 46 47.46",9.39,9.35,"B8III          ","B8","III       ",311.46806199999997,45.779850000000003,1.6500000000000004]
["BD+35 4258","","** ","","",311.55273411000002,"20 46 12.6",35.540437050000001,"+35 32 25.57",9.42,9.4600000000000009,"B0.5Vn         ","B0","Vn        ",311.55273411000002,35.540437050000001,1.5399999999999991]
["HD 198056","","*  ",null,"",311.69783648999999,"20 46 47.4",32.41992192,"+32 25 11.71",6.99,7.0289999999999999,"B9V            ","B9","V         ",311.69783648999999,32.41992192,3.9710000000000001]
["HD 198195","","*i*",null,"",311.79133043000002,"20 47 9.9",42.40984169,"+42 24 35.43",7.34,7.42,"B9III          ","B9","III       ",311.79133043000002,42.40984169,3.58]
["lam Cyg","","Be*",null,"Be",311.85224025999997,"20 47 24.5",36.490714910000001,"+36 29 26.57",4.63,4.75,"B5Ve            ","B5","Ve        ",311.85224025999997,36.490714910000001,6.25]
["lam Cyg","","Be*",null,"Be",311.85224025999997,"20 47 24.5",36.490714910000001,"+36 29 26.57",4.63,4.75,"B5Ve            ","B5","Ve        ",311.85224025999997,36.490714910000001,6.25]
["BD+35 4267B","","*i*",null,"",311.85225000000003,"20 47 24.5",36.490720000000003,"+36 29 26.59",5.96,6.06,"B7V            ","B7","V         ",311.85225000000003,36.490720000000003,4.9400000000000004]
["BD+44 3579","","*  ",null,"",311.88922459999998,"20 47 33.4",45.490226100000001,"+45 29 24.81",9.83,9.6,"B5V             ","B5","V         ",311.88922459999998,45.490226100000001,1.4000000000000004]
["BD+44 3579","","*  ",null,"",311.88922459999998,"20 47 33.4",45.490226100000001,"+45 29 24.81",9.83,9.6,"B5V             ","B5","V         ",311.88922459999998,45.490226100000001,1.4000000000000004]
["BD+45 3279","","*  ",null,"",311.90355782,"20 47 36.8",45.674804479999999,"+45 40 29.29",9.6300000000000008,9.5299999999999994,"B6V            ","B6","V         ",311.90355782,45.674804479999999,1.4700000000000006]
["V367 Cyg","Var","bL*",null,"",311.99826973,"20 47 59.5",39.287701400000003,"+39 17 15.72",7.68,6.99,"B8peIa+F4III   ","B8","peIa+F4III",311.99826973,39.287701400000003,4.01]
["HD 198414","","V* ",null,"",312.10974594999999,"20 48 26.3",45.45210247,"+45 27 7.56",7.53,7.59,"B7IIIv         ","B7","IIIv      ",312.10974594999999,45.45210247,3.41]
["HD 198512                ",{"$f":"IF(LEFT(A2129,2)=\"V*\",\"var\",\"\")","v":""},"Be*","","Be",312.13655488000001,"20 48 32.7",53.906103209999998," 53 54 21.97",8.48,8.14,"B1Vnnpe        ","B1","Vnnpe     ",312.13655488000001,53.906103209999998,2.8599999999999994]
["BD+51 2957A","","*i*",null,"",312.17807499999998,"20 48 42.7",51.910314,"+51 54 37.13",6.2869999999999999,6.3970000000000002,"B8V            ","B8","V         ",312.17807499999998,51.910314,4.6029999999999998]
["HR 7978","","*  ",null,"",312.17809324000001,"20 48 42.7",51.910328849999999,"+51 54 37.18",6.2770000000000001,6.3719999999999999,"B8np           ","B8","np        ",312.17809324000001,51.910328849999999,4.6280000000000001]
["HD 198479                ",{"$f":"IF(LEFT(A2132,2)=\"V*\",\"var\",\"\")","v":""},"*  ","","",312.22912557000001,"20 48 54.9",45.624229339999999," 45 37 27.22",8.9,8.6199999999999992,"B1III          ","B1","III       ",312.22912557000001,45.624229339999999,2.3800000000000008]
["HR 7993","","*  ","","",312.32246242999997,"20 49 17.3",64.042258590000003,"+64 2 32.13",6.4779999999999998,6.4550000000000001,"B0.5V          ","B0","V         ",312.32246242999997,64.042258590000003,4.5449999999999999]
["HR 7983","","Em*","Em","",312.47768865,"20 49 54.6",46.661337250000003,"+46 39 40.81",6.27,6.33,"B4Ve           ","B4","Ve        ",312.47768865,46.661337250000003,4.67]
["HD 198895                ",{"$f":"IF(LEFT(A2135,2)=\"V*\",\"var\",\"\")","v":""},"Be*","","Be",312.79161083999998,"20 51 9.9",55.488746020000001," 55 29 19.48",8.7799999999999994,8.33,"B1Ve           ","B1","Ve        ",312.79161083999998,55.488746020000001,2.67]
["V1792 Cyg","Var","El*","","",312.87890841000001,"20 51 30.9",37.98949262,"+37 59 22.17",7.36,7.27,"B2V            ","B2","V         ",312.87890841000001,37.98949262,3.7300000000000004]
["HD 198915","","*  ",null,"",312.98896180999998,"20 51 57.3",46.734781580000003,"+46 44 5.21",7.43,7.5,"B6V            ","B6","V         ",312.98896180999998,46.734781580000003,3.5]
["HR 7996","","*  ","","",313.00162470999999,"20 52 0.3",32.84889579,"+32 50 56.02",6.2720000000000002,6.4059999999999997,"B3III          ","B3","III       ",313.00162470999999,32.84889579,4.5940000000000003]
["Y Cyg","Var","Al*","","",313.01490654999998,"20 52 3.5",34.657633339999997,"+34 39 27.48",7.23,7.32,"B0IVv...       ","B0","IVv...    ",313.01490654999998,34.657633339999997,3.6799999999999997]
["HD 198931                ",{"$f":"IF(LEFT(A2140,2)=\"V*\",\"var\",\"\")","v":""},"Be*","","Be",313.04049491000001,"20 52 9.7",44.43461302," 44 26 4.6",9.27,8.81,"B1Vnne...      ","B1","Vnne...   ",313.04049491000001,44.43461302,2.1899999999999995]
["HD 199021","","*  ","","",313.22169529000001,"20 52 53.2",42.607743249999999,"+42 36 27.87",8.94,8.49,"B0V            ","B0","V         ",313.22169529000001,42.607743249999999,2.5099999999999998]
["HD 198946","","*  ",null,"",313.23419806999999,"20 52 56.2",29.33192137,"+29 19 54.91",7.64,7.69,"B9V            ","B9","V         ",313.23419806999999,29.33192137,3.3099999999999996]
["BD+47 3211","","*  ","","",313.26266079999999,"20 53 3",47.938383600000002,"+47 56 18.18",10.42,9.94,"B0II-III       ","B0","II-III    ",313.26266079999999,47.938383600000002,1.0600000000000005]
["57 Cyg","","Al*",null,"",313.31147928000001,"20 53 14.7",44.387261340000002,"+44 23 14.14",4.649,4.7779999999999996,"B5V             ","B5","V         ",313.31147928000001,44.387261340000002,6.2220000000000004]
["57 Cyg","","Al*",null,"",313.31147928000001,"20 53 14.7",44.387261340000002,"+44 23 14.14",4.649,4.7779999999999996,"B5V             ","B5","V         ",313.31147928000001,44.387261340000002,6.2220000000000004]
["HD 199121","","*  ",null,"",313.38403419999997,"20 53 32.1",46.029266900000003,"+46 1 45.36",8.9499999999999993,9.01,"B8V            ","B8","V         ",313.38403419999997,46.029266900000003,1.9900000000000002]
["HD 199042","","*i*",null,"",313.38627921,"20 53 32.7",30.951337970000001,"+30 57 4.81",7.85,7.92,"B9V            ","B9","V         ",313.38627921,30.951337970000001,3.08]
["BD+37 4092               ",{"$f":"IF(LEFT(A2148,2)=\"V*\",\"var\",\"\")","v":""},"*  ","","",313.41931169999998,"20 53 40.6",38.188188099999998," 38 11 17.47",9.89,9.65,"B1III          ","B1","III       ",313.41931169999998,38.188188099999998,1.3499999999999996]
["HD 199308","","*  ","","",313.46741995999997,"20 53 52.1",56.363016790000003,"+56 21 46.86",7.65,7.51,"B2IV-V         ","B2","IV-V      ",313.46741995999997,56.363016790000003,3.49]
["HD 199102","","*  ",null,"",313.48634343999998,"20 53 56.7",29.499668249999999,"+29 29 58.8",8,8.02,"B9V            ","B9","V         ",313.48634343999998,29.499668249999999,2.9800000000000004]
["BD+46 3094","","*  ",null,"",313.53552619999999,"20 54 8.5",47.049308600000003,"+47 2 57.51",9.67,9.61,"B9V            ","B9","V         ",313.53552619999999,47.049308600000003,1.3900000000000006]
["BD+40 4353","","*  ","","",313.56716290000003,"20 54 16.1",40.837140599999998,"+40 50 13.7",10.54,9.4600000000000009,"B2Ve           ","B2","Ve        ",313.56716290000003,40.837140599999998,1.5399999999999991]
["HR 8009","","Be*",null,"Be",313.59272704,"20 54 22.2",40.702959470000003,"+40 42 10.65",6.6150000000000002,6.6959999999999997,"B8IVnne        ","B8","IVnne     ",313.59272704,40.702959470000003,4.3040000000000003]
["BW Vul","Var","bC*","","",313.59331344999998,"20 54 22.3",28.52199792,"+28 31 19.19",6.4,6.54,"B2IIIv         ","B2","IIIv      ",313.59331344999998,28.52199792,4.46]
["HD 199309","","*  ",null,"",313.65251368000003,"20 54 36.6",47.73973178,"+47 44 23.03",8.66,8.65,"B8V            ","B8","V         ",313.65251368000003,47.73973178,2.3499999999999996]
["BD+44 3627","","*  ","","",313.69779790000001,"20 54 47.4",44.8462508,"+44 50 46.5",10.55,9.9600000000000009,"B3V            ","B3","V         ",313.69779790000001,44.8462508,1.0399999999999991]
["BD+39 4364","","*  ",null,"",313.73623040000001,"20 54 56.6",39.687186099999998,"+39 41 13.86",10.11,9.98,"B8III          ","B8","III       ",313.73623040000001,39.687186099999998,1.0199999999999996]
["HD 199415","","*  ",null,"",313.82479819000002,"20 55 17.9",47.484839999999998,"+47 29 5.42",8.92,8.86,"B8V            ","B8","V         ",313.82479819000002,47.484839999999998,2.1400000000000006]
["HD 199417","","*  ",null,"",313.84189459999999,"20 55 22",44.879824399999997,"+44 52 47.36",9.06,9.0299999999999994,"B9V            ","B9","V         ",313.84189459999999,44.879824399999997,1.9700000000000006]
["HD 199356","","Be*","","Be",313.84629976999997,"20 55 23.1",40.30002786,"+40 18 0.1",7.2949999999999999,7.157,"B2IVp          ","B2","IVp       ",313.84629976999997,40.30002786,3.843]
["HD 199479","","*  ","","",313.99586448000002,"20 55 59",44.373933860000001,"+44 22 26.16",6.7850000000000001,6.83,"B9V            ","B9","V         ",313.99586448000002,44.373933860000001,4.17]
["HR 8022","","*  ",null,"",314.05328613,"20 56 12.7",51.075020850000001,"+51 4 30.07",6.4939999999999998,6.6,"B5V             ","B5","V         ",314.05328613,51.075020850000001,4.4000000000000004]
["HR 8022","","*  ",null,"",314.05328613,"20 56 12.7",51.075020850000001,"+51 4 30.07",6.4939999999999998,6.6,"B5V             ","B5","V         ",314.05328613,51.075020850000001,4.4000000000000004]
["HR 8029","","*  ","","",314.07087455999999,"20 56 17",56.887518190000002,"+56 53 15.06",6.0510000000000002,6.2089999999999996,"B2.5IV         ","B2","IV        ",314.07087455999999,56.887518190000002,4.7910000000000004]
["BD+42 3914","","*  ","","",314.10036459999998,"20 56 24",43.129579440000001,"+43 7 46.48",9.41,8.51,"B0III:         ","B0","III:      ",314.10036459999998,43.129579440000001,2.4900000000000002]
["BD+36 4329","","*  ",null,"",314.12098329999998,"20 56 29",36.937965800000001,"+36 56 16.67",9.9700000000000006,9.8800000000000008,"B8III          ","B8","III       ",314.12098329999998,36.937965800000001,1.1199999999999992]
["S Equ","Var","Al*",null,"",314.30350264999998,"20 57 12.8",5.0803883799999996,"+5 4 49.39",8.43,8.3699999999999992,"B8V+...        ","B8","V+...     ",314.30350264999998,5.0803883799999996,2.6300000000000008]
["HD 199889","","*  ",null,"",314.55650112000001,"20 58 13.5",48.760762880000001,"+48 45 38.74",8.41,8.33,"B8V            ","B8","V         ",314.55650112000001,48.760762880000001,2.67]
["HD 199890","","*  ",null,"",314.56378001000002,"20 58 15.3",47.617682080000002,"+47 37 3.65",7.4,7.51,"B5V             ","B5","V         ",314.56378001000002,47.617682080000002,3.49]
["HD 199890","","*  ",null,"",314.56378001000002,"20 58 15.3",47.617682080000002,"+47 37 3.65",7.4,7.51,"B5V             ","B5","V         ",314.56378001000002,47.617682080000002,3.49]
["BD+44 3655               ",{"$f":"IF(LEFT(A2171,2)=\"V*\",\"var\",\"\")","v":""},"*  ","","",314.60631978999999,"20 58 25.5",45.14974204," 45 8 59.07",9.4600000000000009,9.24,"B1IV           ","B1","IV        ",314.60631978999999,45.14974204,1.7599999999999998]
["CCDM J20585+5028AB","","** ",null,"",314.62514105000002,"20 58 30",50.46178914,"+50 27 42.44",5.46,5.6,"B5Vn            ","B5","Vn        ",314.62514105000002,50.46178914,5.4]
["CCDM J20585+5028AB","","** ",null,"",314.62514105000002,"20 58 30",50.46178914,"+50 27 42.44",5.46,5.6,"B5Vn            ","B5","Vn        ",314.62514105000002,50.46178914,5.4]
["HR 8036","","*  ",null,"",314.62897468,"20 58 30.9",41.939922539999998,"+41 56 23.72",6.0830000000000002,6.1589999999999998,"B7III          ","B7","III       ",314.62897468,41.939922539999998,4.8410000000000002]
["HD 199837","","*  ",null,"",314.68208422999999,"20 58 43.7",31.647510149999999,"+31 38 51.03",7.14,7.19,"B9V            ","B9","V         ",314.68208422999999,31.647510149999999,3.8099999999999996]
["BD+39 4392","","*  ",null,"",314.79401330000002,"20 59 10.5",39.773743099999997,"+39 46 25.47",10.17,9.8800000000000008,"B9III          ",{"$f":"+LEFT(L2176,2)","v":"B9"},{"$f":"+IF(MID(L2176,3,1)=\".\",MID(L2176,5,10),MID(L2176,3,10))","v":"III       "},314.79401330000002,39.773743099999997,1.1199999999999992]
["HD 200041","","*  ",null,"",314.82499749999999,"20 59 17.9",48.309276699999998,"+48 18 33.39",9.35,9.34,"B7V            ","B7","V         ",314.82499749999999,48.309276699999998,1.6600000000000001]
["BD+46 3129","","*  ",null,"",314.83064960000002,"20 59 19.3",47.340894200000001,"+47 20 27.21",9.56,9.52,"B8III          ","B8","III       ",314.83064960000002,47.340894200000001,{"$f":"11-K2178","v":1.4800000000000004}]
["59 Cyg","","Be*","","Be",314.95648818000001,"20 59 49.5",47.520950450000001,"+47 31 15.42",4.6900000000000004,4.74,"B1.5Vnne       ","B1","Vnne      ",{"$f":"+F2179","v":314.95648818000001},{"$f":"+H2179","v":47.520950450000001},6.26]
["HD 200177","","*  ",null,"",315.02753878999999,"21 0 6.6",48.679447359999998,"+48 40 46.01",7.35,7.34,"B9p            ","B9","p         ",315.02753878999999,48.679447359999998,3.66]
["HD 200269","","Be*",null,"Be",315.20774003000002,"21 0 49.8",46.578586739999999,"+46 34 42.91",7.17,7.28,"B5V             ","B5","V         ",315.20774003000002,46.578586739999999,3.7199999999999998]
["HD 200269","","Be*",null,"Be",315.20774003000002,"21 0 49.8",46.578586739999999,"+46 34 42.91",7.17,7.28,"B5V             ","B5","V         ",315.20774003000002,46.578586739999999,3.7199999999999998]
["* 60 Cyg                 ",{"$f":"IF(LEFT(A2183,2)=\"V*\",\"var\",\"\")","v":""},"Be*","","Be",315.29553503,"21 1 10.9",46.155772669999998," 46 9 20.78",5.2169999999999996,5.4169999999999998,"B1Ve           ","B1","Ve        ",315.29553503,46.155772669999998,5.5830000000000002]
["V2200 Cyg","Var","a2*",null,"",315.30966625999997,"21 1 14.3",43.721788140000001,"+43 43 18.43",7.6,7.68,"B9p            ","B9","p         ",315.30966625999997,43.721788140000001,3.3200000000000003]
["HD 200170","","*  ",null,"",315.33586750000001,"21 1 20.6",16.455805600000001,"+16 27 20.9",9.64,9.64,"B9V            ","B9","V         ",315.33586750000001,16.455805600000001,1.3599999999999994]
["HD 200369","","*  ",null,"",315.36678771999999,"21 1 28",47.205518410000003,"+47 12 19.86",9.0299999999999994,9,"B8V            ","B8","V         ",315.36678771999999,47.205518410000003,2]
["HD 200775","","Or*","","",315.40383185000002,"21 1 36.9",68.163267750000003,"+68 9 47.76",7.73,7.42,"B2Ve           ","B2","Ve        ",315.40383185000002,68.163267750000003,3.58]
["CCDM J21022+5640AB","","** ",null,"",315.53752476,"21 2 9",56.669613810000001,"+56 40 10.6",5.76,5.83,"B8III          ","B8","III       ",315.53752476,56.669613810000001,5.17]
["BD+37 4154","","*  ",null,"",315.65642250000002,"21 2 37.5",38.1414294,"+38 8 29.14",9.93,9.9700000000000006,"B9IV           ","B9","IV        ",315.65642250000002,38.1414294,1.0299999999999994]
["HR 8064","","*  ",null,"",315.70258093000001,"21 2 48.6",45.84888823,"+45 50 55.99",6.359,6.484,"B3Vn           ","B3","Vn        ",315.70258093000001,45.84888823,4.516]
["HD 200615","","*  ",null,"",315.70341463,"21 2 48.8",48.517586389999998,"+48 31 3.31",8.14,8.1300000000000008,"B8V            ","B8","V         ",315.70341463,48.517586389999998,2.8699999999999992]
["BD+46 3155","","*  ",null,"",315.76994330000002,"21 3 4.7",47.173501100000003,"+47 10 24.6",9.56,9.42,"B9V            ","B9","V         ",315.76994330000002,47.173501100000003,1.58]
["HD 200709","","*  ",null,"",315.87128080000002,"21 3 29.1",45.791715600000003,"+45 47 30.17",9.18,9.2100000000000009,"B8V            ","B8","V         ",315.87128080000002,45.791715600000003,1.7899999999999991]
["BD+46 3157","","*  ",null,"",315.88561420000002,"21 3 32.5",46.979995000000002,"+46 58 47.98",9.3800000000000008,9.2799999999999994,"B9V            ","B9","V         ",315.88561420000002,46.979995000000002,1.7200000000000006]
["BD+47 3272","","*  ",null,"",315.90922899999998,"21 3 38.2",48.474818999999997,"+48 28 29.34",9.49,9.44,"B8V            ","B8","V         ",315.90922899999998,48.474818999999997,1.5600000000000005]
["HD 200857","","V* ","","",315.9702145,"21 3 52.8",55.230297610000001,"+55 13 49.07",7.6470000000000002,7.1589999999999998,"B3IIIv         ","B3","IIIv      ",315.9702145,55.230297610000001,3.8410000000000002]
["V1898 Cyg","Var","Al*","","",315.97414873999998,"21 3 53.7",46.330534460000003,"+46 19 49.92",7.8,7.82,"B2IV+G2III     ","B2","IV+G2III  ",315.97414873999998,46.330534460000003,3.1799999999999997]
["HD 200804","","*  ",null,"",315.98568747000002,"21 3 56.5",49.239471440000003,"+49 14 22.09",8.4700000000000006,8.19,"B3IV           ","B3","IV        ",315.98568747000002,49.239471440000003,2.8100000000000005]
["HD 200927","","*  ",null,"",316.18089871000001,"21 4 43.4",49.028887310000002,"+49 1 43.99",8.15,8.0399999999999991,"B6V            ","B6","V         ",316.18089871000001,49.028887310000002,2.9600000000000009]
["BD+45 3393","","*  ",null,"",316.23161959999999,"21 4 55.5",46.541976699999999,"+46 32 31.11",10.039999999999999,9.9700000000000006,"B9V            ","B9","V         ",316.23161959999999,46.541976699999999,1.0299999999999994]
["HD 200944","","*  ","","",316.23572643,"21 4 56.5",47.86991836,"+47 52 11.7",8.5500000000000007,8.52,"B9V            ","B9","V         ",316.23572643,47.86991836,2.4800000000000004]
["HD 201049","","*  ",null,"",316.3691925,"21 5 28.6",48.699193100000002,"+48 41 57.09",9.02,9.02,"B8IV           ","B8","IV        ",316.3691925,48.699193100000002,1.9800000000000004]
["HR 8112","","*  ",null,"",316.37194087,"21 5 29.2",78.126394050000002,"+78 7 35.01",5.8419999999999996,5.915,"B8Vn           ","B8","Vn        ",316.37194087,78.126394050000002,5.085]
["BD+38 4340","","*  ",null,"",316.43682749999999,"21 5 44.8",39.4915278,"+39 29 29.5",9.6999999999999993,9.7200000000000006,"B9IV           ","B9","IV        ",316.43682749999999,39.4915278,1.2799999999999994]
["HD 201114","","*  ",null,"",316.48436799000001,"21 5 56.2",48.044466720000003,"+48 2 40.08",7.62,7.57,"B9V            ","B9","V         ",316.48436799000001,48.044466720000003,3.4299999999999997]
["BD+34 4280","","*  ",null,"",316.54336419999998,"21 6 10.4",34.6148794,"+34 36 53.56",9.8000000000000007,9.75,"B8IV           ","B8","IV        ",316.54336419999998,34.6148794,1.25]
["V2147 Cyg","Var","a2*",null,"",316.65368139999998,"21 6 36.8",48.627822530000003,"+48 37 40.16",8.84,8.84,"B8V            ","B8","V         ",316.65368139999998,48.627822530000003,2.16]
["HD 201269","","*  ",null,"",316.68215787000003,"21 6 43.7",48.189070809999997,"+48 11 20.65",7.63,7.59,"B9V            ","B9","V         ",316.68215787000003,48.189070809999997,3.41]
["BD+45 3414","","*  ",null,"",316.77590249999997,"21 7 6.2",46.286715800000003,"+46 17 12.17",10.19,9.6,"B7V            ","B7","V         ",316.77590249999997,46.286715800000003,1.4000000000000004]
["HD 201359","","*  ",null,"",316.84877678999999,"21 7 23.7",47.277517629999998,"+47 16 39.06",7.23,7.28,"B8V            ","B8","V         ",316.84877678999999,47.277517629999998,3.7199999999999998]
["HD 201254","","*  ","","",316.98919341999999,"21 7 57.4",14.67367756,"+14 40 25.23",6.89,7.02,"B3V            ","B3","V         ",316.98919341999999,14.67367756,3.9800000000000004]
["HD 239581","","*  ","","",317.11521739,"21 8 27.6",56.0453373,"+56 2 43.21",8.26,7.95,"B2V            ","B2","V         ",317.11521739,56.0453373,3.05]
["HD 201522","","Be*","","Be",317.12345959999999,"21 8 29.6",47.257047620000002,"+47 15 25.37",7.84,7.9,"B0V            ","B0","V         ",317.12345959999999,47.257047620000002,3.0999999999999996]
["CCDM J21087+3012AB","","** ",null,"",317.16204070999999,"21 8 38.8",30.20563709,"+30 12 20.29",5.6109999999999998,5.6870000000000003,"B9V            ","B9","V         ",317.16204070999999,30.20563709,5.3129999999999997]
["BD+37 4194","","*  ",null,"",317.23386290000002,"21 8 56.1",37.639217500000001,"+37 38 21.18",9.7799999999999994,9.8000000000000007,"B8IV           ","B8","IV        ",317.23386290000002,37.639217500000001,1.1999999999999993]
["HR 8109","","*  ",null,"",317.37005025000002,"21 9 28.8",63.295668120000002,"+63 17 44.4",6.41,6.5179999999999998,"B7III          ","B7","III       ",317.37005025000002,63.295668120000002,4.4820000000000002]
["BD+37 4201","","*  ",null,"",317.3905383,"21 9 33.7",38.426633600000002,"+38 25 35.88",10,9.94,"B9V            ","B9","V         ",317.3905383,38.426633600000002,1.0600000000000005]
["HD 201666","","*iC","","",317.39421634000001,"21 9 34.6",45.73848778,"+45 44 18.55",7.63,7.66,"B2Vn...        ","B2","Vn...     ",317.39421634000001,45.73848778,3.34]
["HD 201700","","*i*","","",317.44352099999998,"21 9 46.4",46.393768999999999,"+46 23 37.56",8.5299999999999994,8.41,"B3IV           ","B3","IV        ",317.44352099999998,46.393768999999999,2.59]
["HR 8103","","Be*",null,"Be",317.49429872000002,"21 9 58.6",45.502555170000001,"+45 30 9.19",6.47,6.61,"B4IVpe         ","B4","IVpe      ",317.49429872000002,45.502555170000001,4.3899999999999997]
["HR 8106","","*  ","","",317.56489428999998,"21 10 15.5",53.56309933,"+53 33 47.15",5.6340000000000003,5.7430000000000003,"B9III          ","B9","III       ",317.56489428999998,53.56309933,5.2569999999999997]
["BD+44 3723","","*iC","","",317.60200400000002,"21 10 24.4",45.408481000000002,"+45 24 30.53",10.07,9.98,"B3III          ","B3","III       ",317.60200400000002,45.408481000000002,1.0199999999999996]
["HR 8107","","*  ",null,"",317.62898501000001,"21 10 30.9",47.692227109999997,"+47 41 32.01",6.4729999999999999,6.492,"B6IV           ","B6","IV        ",317.62898501000001,47.692227109999997,4.508]
["HD 201795                ",{"$f":"IF(LEFT(A2224,2)=\"V*\",\"var\",\"\")","v":""},"*  ","","",317.66062142999999,"21 10 38.5",38.961202120000003," 38 57 40.32",7.5,7.53,"B1V            ","B1","V         ",317.66062142999999,38.961202120000003,3.4699999999999998]
["HD 201976","","*  ",null,"",317.74358032999999,"21 10 58.4",55.273567810000003,"+55 16 24.84",8.73,8.7100000000000009,"B9V            ","B9","V         ",317.74358032999999,55.273567810000003,2.2899999999999991]
["V1425 Cyg","Var","bL*",null,"",317.75740834999999,"21 11 1.7",55.332218159999996,"+55 19 55.98",7.79,7.73,"B8V            ","B8","V         ",317.75740834999999,55.332218159999996,3.2699999999999996]
["HR 8105                  ",{"$f":"IF(LEFT(A2227,2)=\"V*\",\"var\",\"\")","v":""},"V* ","","",317.76569645000001,"21 11 3.7",36.299580640000002," 36 17 58.49",6.3780000000000001,6.5110000000000001,"B1Vp           ","B1","Vp        ",317.76569645000001,36.299580640000002,4.4889999999999999]
["HD 201910","","*  ",null,"",317.84138110999999,"21 11 21.9",41.185160940000003,"+41 11 6.57",7.2750000000000004,7.3890000000000002,"B5V             ","B5","V         ",317.84138110999999,41.185160940000003,3.6109999999999998]
["HD 201910","","*  ",null,"",317.84138110999999,"21 11 21.9",41.185160940000003,"+41 11 6.57",7.2750000000000004,7.3890000000000002,"B5V             ","B5","V         ",317.84138110999999,41.185160940000003,3.6109999999999998]
["BD+44 3731","","*iC",null,"",317.8433192,"21 11 22.3",45.496492500000002,"+45 29 47.37",9.5500000000000007,9.52,"B5III           ","B5","III       ",317.8433192,45.496492500000002,1.4800000000000004]
["BD+44 3731","","*iC",null,"",317.8433192,"21 11 22.3",45.496492500000002,"+45 29 47.37",9.5500000000000007,9.52,"B5III           ","B5","III       ",317.8433192,45.496492500000002,1.4800000000000004]
["HD 201912","","*i*",null,"",317.95221692000001,"21 11 48.5",29.711685549999999,"+29 42 42.06",6.6859999999999999,6.8259999999999996,"B5III           ","B5","III       ",317.95221692000001,29.711685549999999,4.1740000000000004]
["HD 201912","","*i*",null,"",317.95221692000001,"21 11 48.5",29.711685549999999,"+29 42 42.06",6.6859999999999999,6.8259999999999996,"B5III           ","B5","III       ",317.95221692000001,29.711685549999999,4.1740000000000004]
["BD+36 4455","","*  ",null,"",317.96300000000002,"21 11 51.1",37.093000000000004,"+37 5 34.8",null,9.5,"B8V            ","B8","V         ",317.96300000000002,37.093000000000004,1.5]
["BD+45 3441","","*iC",null,"",317.96699999999998,"21 11 52",45.912999999999997,"+45 54 46.79",9.83,9.3800000000000008,"B5III           ","B5","III       ",317.96699999999998,45.912999999999997,1.6199999999999992]
["BD+45 3441","","*iC",null,"",317.96699999999998,"21 11 52",45.912999999999997,"+45 54 46.79",9.83,9.3800000000000008,"B5III           ","B5","III       ",317.96699999999998,45.912999999999997,1.6199999999999992]
["HD 202068","","*i*",null,"",318.02891210000001,"21 12 6.9",45.703504969999997,"+45 42 12.61",7.73,7.8,"B8V            ","B8","V         ",318.02891210000001,45.703504969999997,3.2]
["HD 202253","","V* ","","",318.28922252000001,"21 13 9.4",43.873776120000002,"+43 52 25.59",7.83,7.72,"B2III          ","B2","III       ",318.28922252000001,43.873776120000002,3.2800000000000002]
["HD 202347                ",{"$f":"IF(LEFT(A2239,2)=\"V*\",\"var\",\"\")","v":""},"*iC","","",318.42440607999998,"21 13 41.8",45.611461560000002," 45 36 41.26",7.41,7.5,"B1V            ","B1","V         ",318.42440607999998,45.611461560000002,3.5]
["HD 202349","","*  ","","",318.52276024000003,"21 14 5.4",37.78160063,"+37 46 53.76",7.1680000000000001,7.3410000000000002,"B0.5V          ",{"$f":"+LEFT(L2240,2)","v":"B0"},{"$f":"+IF(MID(L2240,3,1)=\".\",MID(L2240,5,10),MID(L2240,3,10))","v":"V         "},318.52276024000003,37.78160063,3.6589999999999998]
["BD+38 4408","","*  ",null,"",318.55965120000002,"21 14 14.3",39.128398599999997,"+39 7 42.23",9.85,9.82,"B9V            ","B9","V         ",318.55965120000002,39.128398599999997,1.1799999999999997]
["BD+34 4351","","*  ","","",318.637,"21 14 32.8",35.567,"+35 34 1.2",null,9.5,"B9V            ","B9","V         ",318.637,35.567,{"$f":"11-K2242","v":1.5}]
["HD 239618","","Be*","","Be",318.68951537999999,"21 14 45.4",59.76102848,"+59 45 39.7",9.01,8.66,"B2Ve           ","B2","Ve        ",{"$f":"+F2243","v":318.68951537999999},{"$f":"+H2243","v":59.76102848},2.34]
["HR 8136","","*  ",null,"",318.90490736999999,"21 15 37.1",47.973996550000003,"+47 58 26.38",6.3079999999999998,6.4329999999999998,"B4IV           ","B4","IV        ",318.90490736999999,47.973996550000003,4.5670000000000002]
["BD+38 4422","","*  ",null,"",318.95800000000003,"21 15 49.9",38.645000000000003,"+38 38 42",null,9.5,"B9V            ","B9","V         ",318.95800000000003,38.645000000000003,1.5]
["BD+35 4453","","*  ","","",318.96699999999998,"21 15 52",35.807000000000002,"+35 48 25.2",null,9.5,"B9III          ","B9","III       ",318.96699999999998,35.807000000000002,1.5]
["BD+39 4497","","*  ",null,"",318.99787079999999,"21 15 59.4",40.483673099999997,"+40 29 1.22",9.86,9.84,"B9V            ","B9","V         ",318.99787079999999,40.483673099999997,1.1600000000000001]
["BD+34 4363","","*  ","","",319.13408670000001,"21 16 32.1",34.913298599999997,"+34 54 47.87",9.94,9.9499999999999993,"B9III          ","B9","III       ",319.13408670000001,34.913298599999997,1.0500000000000007]
["BD+41 4072","","*  ",null,"",319.24913249999997,"21 16 59.7",41.999269200000001,"+41 59 57.36",9.7799999999999994,9.76,"B9III          ","B9","III       ",319.24913249999997,41.999269200000001,1.2400000000000002]
["HR 8153","","Be*","","Be",319.32829328999998,"21 17 18.7",58.61148335,"+58 36 41.34",6.58,6.4320000000000004,"B2IIIe         ","B2","IIIe      ",319.32829328999998,58.61148335,4.5679999999999996]
["HR 8144","","*  ",null,"",319.34659805000001,"21 17 23.1",42.683572310000002,"+42 41 0.86",6.0670000000000002,6.1609999999999996,"B7Vn           ","B7","Vn        ",319.34659805000001,42.683572310000002,4.8390000000000004]
["BD+40 4476","","*  ",null,"",319.38817710000001,"21 17 33.1",40.833588900000002,"+40 50 0.92",9.89,9.84,"B9IV           ","B9","IV        ",319.38817710000001,40.833588900000002,1.1600000000000001]
["HD 239626","","*iC","","",319.38946305000002,"21 17 33.4",60.100447469999999,"+60 6 1.61",9.5299999999999994,9.27,"B0V            ","B0","V         ",319.38946305000002,60.100447469999999,1.7300000000000004]
["ups Cyg","","Be*","","Be",319.4794794,"21 17 55",34.896896920000003,"+34 53 48.82",4.32,4.43,"B2Vne          ","B2","Vne       ",319.4794794,34.896896920000003,6.57]
["BD+38 4435","","*  ",null,"",319.4855354,"21 17 56.5",39.198178900000002,"+39 11 53.44",9.8000000000000007,9.73,"B9V            ","B9","V         ",319.4855354,39.198178900000002,1.2699999999999996]
["HD 203374","","Be*","","Be",319.78066276999999,"21 19 7.3",61.858452810000003,"+61 51 30.43",6.91,6.6920000000000002,"B0IVpe         ","B0","IVpe      ",319.78066276999999,61.858452810000003,4.3079999999999998]
["HD 203339","","*i*",null,"",319.81670000000003,"21 19 16",58.624400000000001,"+58 37 27.84",9.5,9.5,"B3Vmpv...      ","B3","Vmpv...   ",319.81670000000003,58.624400000000001,1.5]
["6 Cep","","Be*",null,"Be",319.84258435999999,"21 19 22.2",64.871856140000006,"+64 52 18.68",5.1390000000000002,5.1849999999999996,"B3IVe          ","B3","IVe       ",319.84258435999999,64.871856140000006,5.8150000000000004]
["HR 8161","","*  ",null,"",319.86979265999997,"21 19 28.7",49.510295149999997,"+49 30 37.06",5.61,5.74,"B6V            ","B6","V         ",319.86979265999997,49.510295149999997,5.26]
["BD+38 4450","","*  ",null,"",319.93523579999999,"21 19 44.4",39.5292897,"+39 31 45.44",9.9700000000000006,9.99,"B8III          ","B8","III       ",319.93523579999999,39.5292897,1.0099999999999998]
["HR 8158","","*  ",null,"",320.05864042000002,"21 20 14",22.026190410000002,"+22 1 34.28",6.1790000000000003,6.2830000000000004,"B6IV           ","B6","IV        ",320.05864042000002,22.026190410000002,4.7169999999999996]
["BD+40 4497","","*  ",null,"",320.26269079999997,"21 21 3",40.857811699999999,"+40 51 28.12",9.8800000000000008,9.7899999999999991,"B8III          ","B8","III       ",320.26269079999997,40.857811699999999,1.2100000000000009]
["BD+39 4534","","*  ",null,"",320.404,"21 21 36.9",40.159999999999997,"+40 9 35.99",null,9.5,"B8IV           ","B8","IV        ",320.404,40.159999999999997,1.5]
["BD+40 4501","","*  ",null,"",320.55192620000003,"21 22 12.4",40.6635803,"+40 39 48.88",10.039999999999999,9.93,"B9V            ","B9","V         ",320.55192620000003,40.6635803,1.0700000000000003]
["HD 203731                ",{"$f":"IF(LEFT(A2265,2)=\"V*\",\"var\",\"\")","v":""},"Be*","","Be",320.71312048999999,"21 22 51.1",40.697244320000003," 40 41 50.07",7.67,7.52,"B1Vne          ","B1","Vne       ",320.71312048999999,40.697244320000003,3.4800000000000004]
["HD 203883","","*  ",null,"",320.72787717,"21 22 54.6",55.650381070000002,"+55 39 1.37",9.07,8.73,"B8V            ","B8","V         ",320.72787717,55.650381070000002,2.2699999999999996]
["SY Equ","Var","bC*","","",320.87003726,"21 23 28.8",9.9319245499999997,"+9 55 54.92",8.33,8.5299999999999994,"B0.5IIIn       ","B0","IIIn      ",320.87003726,9.9319245499999997,2.4700000000000006]
["HD 203699","","Be*","","Be",320.89744080999998,"21 23 35.3",14.050178000000001,"+14 3 0.64",6.75,6.86,"B2.5IVne       ","B2","IVne      ",320.89744080999998,14.050178000000001,4.1399999999999997]
["HD 203938","","*  ","","",320.95906331999998,"21 23 50.1",47.164550009999999,"+47 9 52.38",7.4829999999999997,7.1029999999999998,"B0.5IV         ","B0","IV        ",320.95906331999998,47.164550009999999,3.8970000000000002]
["HD 204001","","*  ","","",320.99163735000002,"21 23 57.9",51.657183340000003,"+51 39 25.86",7.0019999999999998,7.0869999999999997,"B9IV           ","B9","IV        ",320.99163735000002,51.657183340000003,3.9130000000000003]
["HD 203921","","*iC",null,"",321.05769973000002,"21 24 13.8",36.42797084,"+36 25 40.69",8.86,8.89,"B9IV           ","B9","IV        ",321.05769973000002,36.42797084,2.1099999999999994]
["HD 204150","","*  ","","",321.0587554,"21 24 14.1",60.7973067,"+60 47 50.3",7.74,7.72,"B2V            ","B2","V         ",321.0587554,60.7973067,3.2800000000000002]
["HD 204116                ",{"$f":"IF(LEFT(A2273,2)=\"V*\",\"var\",\"\")","v":""},"Be*","","Be",321.12640834000001,"21 24 30.3",55.366733519999997," 55 22 0.24",7.99,7.55,"B1Ve           ","B1","Ve        ",321.12640834000001,55.366733519999997,3.45]
["BD+35 4515","","*iC",null,"",321.12947523999998,"21 24 31",36.498493080000003,"+36 29 54.57",9.6300000000000008,9.65,"B7V            ","B7","V         ",321.12947523999998,36.498493080000003,1.3499999999999996]
["V1934 Cyg","Var","a2*",null,"",321.23099467999998,"21 24 55.4",49.323127190000001,"+49 19 23.25",6.5650000000000004,6.5670000000000002,"B9sp...        ","B9","sp...     ",321.23099467999998,49.323127190000001,4.4329999999999998]
["BD+38 4488","","*  ",null,"",321.29032080000002,"21 25 9.6",39.5453142,"+39 32 43.13",9.94,9.9,"B8IV           ","B8","IV        ",321.29032080000002,39.5453142,1.0999999999999996]
["HR 8218","","*  ",null,"",321.68737532,"21 26 44.9",52.898535150000001,"+52 53 54.72",5.8810000000000002,5.9889999999999999,"B6V            ","B6","V         ",321.68737532,52.898535150000001,5.0110000000000001]
["HD 204375","","*  ","","",321.69402767000003,"21 26 46.5",43.81233641,"+43 48 44.41",7.46,7.45,"B9V            ","B9","V         ",321.69402767000003,43.81233641,3.55]
["HD 239671","","*  ","","",321.80591593999998,"21 27 13.4",56.208385149999998,"+56 12 30.18",9.49,9.01,"B2V            ","B2","V         ",321.80591593999998,56.208385149999998,1.9900000000000002]
["BD+38 4503","","*  ",null,"",321.81200000000001,"21 27 14.8",38.838000000000001,"+38 50 16.8",null,9.5,"B8V            ","B8","V         ",321.81200000000001,38.838000000000001,1.5]
["70 Cyg","","*  ","","",321.83902611000002,"21 27 21.3",37.116797320000003,"+37 7 0.47",5.15,5.2889999999999997,"B3V            ","B3","V         ",321.83902611000002,37.116797320000003,5.7110000000000003]
["7 Cep","","*  ",null,"",321.94225428999999,"21 27 46.1",66.809096060000002,"+66 48 32.74",5.31,5.407,"B7V            ","B7","V         ",321.94225428999999,66.809096060000002,5.593]
["HD 204536","","*  ","","",321.97634833000001,"21 27 54.3",46.561512010000001,"+46 33 41.44",6.7709999999999999,6.8490000000000002,"B3III          ","B3","III       ",321.97634833000001,46.561512010000001,4.1509999999999998]
["bet Cep","Var","bC*","","",322.16498688000001,"21 28 39.5",70.560715189999996,"+70 33 38.57",3.0150000000000001,3.2160000000000002,"B2IIIev        ","B2","IIIev     ",322.16498688000001,70.560715189999996,7.7839999999999998]
["BD+38 4505","","*  ","","",322.17099999999999,"21 28 41",39.311999999999998,"+39 18 43.19",null,9.5,"B9III          ","B9","III       ",322.17099999999999,39.311999999999998,1.5]
["HR 8226","","V* ",null,"",322.21974103000002,"21 28 52.7",55.41870076,"+55 25 7.32",6.2320000000000002,6.1449999999999996,"B8III          ","B8","III       ",322.21974103000002,55.41870076,4.8550000000000004]
["HD 204827","","*i*","","",322.24067172999997,"21 28 57.7",58.739786680000002,"+58 44 23.23",8.69,8,"O9.5V            ","O9","V         ",322.24067172999997,58.739786680000002,3]
["HD 204722","","Be*","","Be",322.31185318000001,"21 29 14.8",44.338125810000001,"+44 20 17.25",7.61,7.63,"B2V:nne...     ","B2","V:nne...  ",322.31185318000001,44.338125810000001,3.37]
["BD+38 4510","","*  ",null,"",322.358,"21 29 25.9",39.616999999999997,"+39 37 1.19",null,9.4,"B9V            ","B9","V         ",322.358,39.616999999999997,1.5999999999999996]
["HD 239683","","*iC","","",322.47276217000001,"21 29 53.4",57.815878750000003,"+57 48 57.16",9.5500000000000007,9.32,"B3IV           ","B3","IV        ",322.47276217000001,57.815878750000003,1.6799999999999997]
["BD+40 4550","","*  ",null,"",322.55829249999999,"21 30 13.9",40.734693300000004,"+40 44 4.89",9.91,9.7899999999999991,"B9IV           ","B9","IV        ",322.55829249999999,40.734693300000004,1.2100000000000009]
["BD+47 3434","","*iC",null,"",322.65855399999998,"21 30 38",47.714958000000003,"+47 42 53.84",9.9499999999999993,9.67,"B5V:            ","B5","V:        ",322.65855399999998,47.714958000000003,1.33]
["BD+47 3434","","*iC",null,"",322.65855399999998,"21 30 38",47.714958000000003,"+47 42 53.84",9.9499999999999993,9.67,"B5V:            ","B5","V:        ",322.65855399999998,47.714958000000003,1.33]
["BD+38 4514","","*  ",null,"",322.67899999999997,"21 30 42.9",39.548000000000002,"+39 32 52.8",null,9.5,"B8V            ","B8","V         ",322.67899999999997,39.548000000000002,1.5]
["HD 239689","","*iC","","",322.69136097000001,"21 30 45.9",57.200044419999998,"+57 12 0.15",9,8.8699999999999992,"B1.5V          ","B1","V         ",322.69136097000001,57.200044419999998,2.1300000000000008]
["HD 239693","","*  ","","",322.85812049999998,"21 31 25.9",57.899026399999997,"+57 53 56.49",9.76,9.6300000000000008,"B3V            ","B3","V         ",322.85812049999998,57.899026399999997,1.3699999999999992]
["HD 205210","","*iC",null,"",323.07112756999999,"21 32 17",48.443829219999998,"+48 26 37.78",6.57,6.5720000000000001,"B9IV           ","B9","IV        ",323.07112756999999,48.443829219999998,4.4279999999999999]
["HR 8240","","*  ",null,"",323.11255972999999,"21 32 27",23.394583690000001,"+23 23 40.5",6.6189999999999998,6.6849999999999996,"B9sp...        ","B9","sp...     ",323.11255972999999,23.394583690000001,4.3150000000000004]
["HD 235536","","*  ",null,"",323.12888800000002,"21 32 30.9",53.765999999999998,"+53 45 57.59",9.84,9.61,"B9V            ","B9","V         ",323.12888800000002,53.765999999999998,1.3900000000000006]
["HD 235538","","*  ",null,"",323.14972782000001,"21 32 35.9",53.806523630000001,"+53 48 23.48",9.0399999999999991,8.81,"B9V            ","B9","V         ",323.14972782000001,53.806523630000001,2.1899999999999995]
["BD+48 3416","","Em*","Em","",323.21555499999999,"21 32 51.7",49.0249272,"+49 1 29.73",10.16,9.92,"B8V:           ","B8","V:        ",323.21555499999999,49.0249272,1.08]
["HD 239697","","*iC",null,"",323.47792920000001,"21 33 54.7",57.293630800000003,"+57 17 37.07",9.5500000000000007,9.39,"B9V            ","B9","V         ",323.47792920000001,57.293630800000003,1.6099999999999994]
["HR 8259","","Be*",null,"Be",323.61442862000001,"21 34 27.4",51.698464389999998,"+51 41 54.47",6.1449999999999996,6.1639999999999997,"B9IIIe         ","B9","IIIe      ",323.61442862000001,51.698464389999998,4.8360000000000003]
["BD+47 3482","","*iC",null,"",323.87889869999998,"21 35 30.9",48.169161099999997,"+48 10 8.97",10.32,9.99,"B5IV:           ",{"$f":"+LEFT(L2304,2)","v":"B5"},{"$f":"+IF(MID(L2304,3,1)=\".\",MID(L2304,5,10),MID(L2304,3,10))","v":"IV:       "},323.87889869999998,48.169161099999997,1.0099999999999998]
["BD+47 3482","","*iC",null,"",323.87889869999998,"21 35 30.9",48.169161099999997,"+48 10 8.97",10.32,9.99,"B5IV:           ","B5","IV:       ",323.87889869999998,48.169161099999997,1.0099999999999998]
["HD 205794","","*iC","","",323.93262249999998,"21 35 43.8",57.467634400000001,"+57 28 3.48",8.7100000000000009,8.43,"B0.5V          ","B0","V         ",323.93262249999998,57.467634400000001,{"$f":"11-K2306","v":2.5700000000000003}]
["HD 205618","","Be*","","Be",323.93532197000002,"21 35 44.4",29.745526129999998,"+29 44 43.89",8.1300000000000008,8.16,"B2Vne          ","B2","Vne       ",{"$f":"+F2307","v":323.93532197000002},{"$f":"+H2307","v":29.745526129999998},2.84]
["HD 239710","","*iN","","",324.17099789999997,"21 36 41",57.502294399999997,"+57 30 8.25",9.75,9.48,"B3V            ","B3","V         ",324.17099789999997,57.502294399999997,1.5199999999999996]
["HD 205948","","*iC","","",324.19946700000003,"21 36 47.8",57.583914,"+57 35 2.09",8.83,8.6,"B2V            ","B2","V         ",324.19946700000003,57.583914,2.4000000000000004]
["HD 206135","","Be*","","Be",324.23773373,"21 36 57",68.185362859999998,"+68 11 7.3",8.39,8.27,"B3V            ","B3","V         ",324.23773373,68.185362859999998,2.7300000000000004]
["HD 239712","","Be*","","Be",324.24850020999997,"21 36 59.6",58.14016822,"+58 8 24.6",8.9,8.5299999999999994,"B2Vnne         ","B2","Vnne      ",324.24850020999997,58.14016822,2.4700000000000006]
["HD 239722","","*iC","","",324.55856275000002,"21 38 14",59.167523150000001,"+59 10 3.08",10.16,9.6199999999999992,"B2IV           ","B2","IV        ",324.55856275000002,59.167523150000001,1.3800000000000008]
["HD 206183","","*i*","","",324.60951834999997,"21 38 26.2",56.973739389999999,"+56 58 25.46",7.55,7.41,"O9.5V            ","O9","V         ",324.60951834999997,56.973739389999999,3.59]
["HD 239724                ",{"$f":"IF(LEFT(A2314,2)=\"V*\",\"var\",\"\")","v":""},"*iC","","",324.66471289999998,"21 38 39.5",57.367124199999999," 57 22 1.64",9.42,9.11,"B1III          ","B1","III       ",324.66471289999998,57.367124199999999,1.8900000000000006]
["BD+56 2617D","","*i*","","",324.73628153999999,"21 38 56.7",57.494189749999997,"+57 29 39.08",8.01,7.88,"B0V            ","B0","V         ",324.73628153999999,57.494189749999997,3.12]
["BD+56 2617C","","*i*","","",324.74538163,"21 38 58.8",57.487404550000001,"+57 29 14.65",8.34,8.1,"B0V            ","B0","V         ",324.74538163,57.487404550000001,2.9000000000000004]
["HD 206327","","*  ","","",324.75433572999998,"21 39 1",61.556150199999998,"+61 33 22.14",9.3699999999999992,9.19,"B2V            ","B2","V         ",324.75433572999998,61.556150199999998,1.8100000000000005]
["HD 239725","","*iC","","",324.76979145000001,"21 39 4.7",56.949829260000001,"+56 56 59.38",9.33,9.17,"B2.5V          ","B2","V         ",324.76979145000001,56.949829260000001,1.83]
["HD 235579","","*  ",null,"",324.79485,"21 39 10.7",54.1524389,"+54 9 8.78",9.69,9.6,"B5V             ","B5","V         ",324.79485,54.1524389,1.4000000000000004]
["HD 235579","","*  ",null,"",324.79485,"21 39 10.7",54.1524389,"+54 9 8.78",9.69,9.6,"B5V             ","B5","V         ",324.79485,54.1524389,1.4000000000000004]
["HD 206259","","*  ",null,"",324.82301796000002,"21 39 17.5",52.362471909999996,"+52 21 44.89",7.59,7.54,"B3III          ","B3","III       ",324.82301796000002,52.362471909999996,3.46]
["HD 239729","","*  ","","",324.86418593000002,"21 39 27.4",57.483553759999999,"+57 29 0.79",8.65,8.36,"B0V            ","B0","V         ",324.86418593000002,57.483553759999999,2.6400000000000006]
["DL Cyg","Var","Al*","","",324.943625,"21 39 46.4",48.5399642,"+48 32 23.87",9.8699999999999992,9.66,"B3V            ","B3","V         ",324.943625,48.5399642,1.3399999999999999]
["HD 239732","","*iC",null,"",324.99001579999998,"21 39 57.6",57.604551899999997,"+57 36 16.38",9.82,9.77,"B8V            ","B8","V         ",324.99001579999998,57.604551899999997,1.2300000000000004]
["HD 235586","","*  ","","",325.10122364,"21 40 24.2",54.029840710000002,"+54 1 47.42",9.1,8.92,"B2V            ","B2","V         ",325.10122364,54.029840710000002,2.08]
["HD 239738","","*iC","","",325.49387439999998,"21 41 58.5",58.50005797,"+58 30 0.2",8.82,8.59,"B2IV           ","B2","IV        ",325.49387439999998,58.50005797,2.41]
["80 Cyg","","*  ",null,"",325.52360241999997,"21 42 5.6",51.189622640000003,"+51 11 22.64",4.55,4.66,"B3IV           ","B3","IV        ",325.52360241999997,51.189622640000003,6.34]
["HD 206773","","Be*","","Be",325.60076978000001,"21 42 24.1",57.736054719999998,"+57 44 9.79",7.06,6.9269999999999996,"B0V:pe         ","B0","V:pe      ",325.60076978000001,57.736054719999998,4.0730000000000004]
["HR 8292","","*  ",null,"",325.63732447000001,"21 42 32.9",10.82431332,"+10 49 27.52",5.9370000000000003,6.0519999999999996,"B5IV            ","B5","IV        ",325.63732447000001,10.82431332,4.9480000000000004]
["HR 8292","","*  ",null,"",325.63732447000001,"21 42 32.9",10.82431332,"+10 49 27.52",5.9370000000000003,6.0519999999999996,"B5IV            ","B5","IV        ",325.63732447000001,10.82431332,4.9480000000000004]
["HD 239743","","*iC","","",325.69429136000002,"21 42 46.6",60.295921120000003,"+60 17 45.31",9.5299999999999994,9.0299999999999994,"B2V            ","B2","V         ",325.69429136000002,60.295921120000003,1.9700000000000006]
["HD 239742","","*iC","","",325.71709121999999,"21 42 52.1",57.016948880000001,"+57 1 1.01",9.57,9.4,"B2V            ","B2","V         ",325.71709121999999,57.016948880000001,1.5999999999999996]
["HD 239745                ",{"$f":"IF(LEFT(A2333,2)=\"V*\",\"var\",\"\")","v":""},"Em*","Em","",325.85193258999999,"21 43 24.4",57.023153499999999," 57 1 23.35",9.1300000000000008,8.92,"B1V            ","B1","V         ",325.85193258999999,57.023153499999999,2.08]
["HD 206636","","*  ",null,"",325.87009999999998,"21 43 28.8",5.1414399999999999E-2,"+0 3 5.09",9.2899999999999991,9.15,"B7V            ","B7","V         ",325.87009999999998,5.1414399999999999E-2,1.8499999999999996]
["HD 239748                ",{"$f":"IF(LEFT(A2335,2)=\"V*\",\"var\",\"\")","v":""},"*iC","","",325.92208878000002,"21 43 41.3",58.239802150000003," 58 14 23.28",8.9,8.77,"B1V            ","B1","V         ",325.92208878000002,58.239802150000003,2.2300000000000004]
["HD 207017","","*  ","","",325.93810889000002,"21 43 45.1",62.771539490000002,"+62 46 17.54",8.77,8.59,"B2V            ","B2","V         ",325.93810889000002,62.771539490000002,2.41]
["HD 239747","","*iC","","",325.94445039999999,"21 43 46.6",56.938101099999997,"+56 56 17.16",10.029999999999999,9.66,"B0.5V          ","B0","V         ",325.94445039999999,56.938101099999997,1.3399999999999999]
["HD 239758","","Be*","","Be",326.14172151000002,"21 44 34",59.057149639999999,"+59 3 25.73",9.68,9.43,"B2III:nn       ","B2","III:nn    ",326.14172151000002,59.057149639999999,1.5700000000000003]
["BD+28 4177               ",{"$f":"IF(LEFT(A2339,2)=\"V*\",\"var\",\"\")","v":""},"*  ","","",326.25564374999999,"21 45 1.3",29.561668099999999," 29 33 42",9.76,9.86,"B1IV           ","B1","IV        ",326.25564374999999,29.561668099999999,1.1400000000000006]
["HD 207308","","*  ","","",326.42652498000001,"21 45 42.3",62.30834016,"+62 18 30.02",7.74,7.49,"B0.5V          ","B0","V         ",326.42652498000001,62.30834016,3.51]
["BD+49 3615               ",{"$f":"IF(LEFT(A2341,2)=\"V*\",\"var\",\"\")","v":""},"Be*","","Be",326.46734604,"21 45 52.1",50.292483799999999," 50 17 32.94",9.3000000000000007,9.0299999999999994,"B1V:           ","B1","V:        ",326.46734604,50.292483799999999,1.9700000000000006]
["AI Cep","Var","bL*","","",326.59413383999998,"21 46 22.5",56.917173980000001,"+56 55 1.82",9.84,9.31,"B0.5V:pv       ","B0","V:pv      ",326.59413383999998,56.917173980000001,1.6899999999999995]
["81 Cyg","","*  ",null,"",326.69836799000001,"21 46 47.6",49.309569750000001,"+49 18 34.45",4.1100000000000003,4.18,"B3III          ","B3","III       ",326.69836799000001,49.309569750000001,6.82]
["HR 8338","","*  ",null,"",327.12232948000002,"21 48 29.3",38.648575620000003,"+38 38 54.87",6.0220000000000002,6.0940000000000003,"B8V            ","B8","V         ",327.12232948000002,38.648575620000003,4.9059999999999997]
["HR 8341","","*  ","","",327.36194394,"21 49 26.8",20.462443669999999,"+20 27 44.79",6.1680000000000001,6.2640000000000002,"B2V            ","B2","V         ",327.36194394,20.462443669999999,4.7359999999999998]
["HD 207793","","V* ","","",327.51034907000002,"21 50 2.4",52.697317699999999,"+52 41 50.34",6.8810000000000002,6.5759999999999996,"B0.5III        ","B0","III       ",327.51034907000002,52.697317699999999,4.4240000000000004]
["HD 207951","","*  ","","",327.66929838999999,"21 50 40.6",61.803122190000003,"+61 48 11.23",8.3000000000000007,8.18,"B2V            ","B2","V         ",327.66929838999999,61.803122190000003,2.8200000000000003]
["V1619 Cyg","Var","a2*",null,"",327.77075303999999,"21 51 4.9",39.536657200000001,"+39 32 11.96",6.1310000000000002,6.1989999999999998,"B9mnp...       ","B9","mnp...    ",327.77075303999999,39.536657200000001,4.8010000000000002]
["HR 8348","","*i*",null,"",327.89270148000003,"21 51 34.2",19.82668168,"+19 49 36.05",5.6689999999999996,5.7720000000000002,"B8III          ","B8","III       ",327.89270148000003,19.82668168,5.2279999999999998]
["V383 Cep","Var","bL*","","",327.94850388999998,"21 51 47.6",61.942910570000002,"+61 56 34.47",7.53,7.44,"B2Vnp          ","B2","Vnp       ",327.94850388999998,61.942910570000002,3.5599999999999996]
["HR 8357","","Ce*",null,"",328.00433232,"21 52 1",55.796730799999999,"+55 47 48.23",5.577,5.6749999999999998,"B6IV-V         ","B6","IV-V      ",328.00433232,55.796730799999999,5.3250000000000002]
["CCDM J21523+6306AB","","** ","","",328.08728365000002,"21 52 20.9",63.101249230000001,"+63 6 4.49",7.48,7.37,"B2V            ","B2","V         ",328.08728365000002,63.101249230000001,3.63]
["BD+62 1992A","","*i*","","",328.08729,"21 52 20.9",63.10125,"+63 6 4.5",7.5,7.4,"B2V            ","B2","V         ",328.08729,63.10125,3.5999999999999996]
["HD 208218                ",{"$f":"IF(LEFT(A2354,2)=\"V*\",\"var\",\"\")","v":""},"*iC","","",328.14644358999999,"21 52 35.1",62.71217223," 62 42 43.82",6.8949999999999996,6.71,"B1III          ","B1","III       ",328.14644358999999,62.71217223,4.29]
["BD+47 3588","","*  ","","",328.19923132999998,"21 52 47.8",48.022448650000001,"+48 1 20.81",9.73,9.64,"B1.5V          ","B1","V         ",328.19923132999998,48.022448650000001,1.3599999999999994]
["HD 208266                ",{"$f":"IF(LEFT(A2356,2)=\"V*\",\"var\",\"\")","v":""},"*  ","","",328.25143863,"21 53 0.3",60.642404900000002," 60 38 32.65",8.36,8.14,"B1V            ","B1","V         ",328.25143863,60.642404900000002,2.8599999999999994]
["16 Peg","","Be*",null,"Be",328.2657011,"21 53 3.7",25.92513615,"+25 55 30.49",4.9249999999999998,5.0780000000000003,"B3Ve           ","B3","Ve        ",328.2657011,25.92513615,5.9219999999999997]
["BD+61 2213","","*  ",null,"",328.36061745000001,"21 53 26.5",62.586989449999997,"+62 35 13.16",9.16,8.98,"B3V+...        ","B3","V+...     ",328.36061745000001,62.586989449999997,2.0199999999999996]
["BD+46 3474               ",{"$f":"IF(LEFT(A2359,2)=\"V*\",\"var\",\"\")","v":""},"*  ","","",328.37018699999999,"21 53 28.8",47.266638999999998," 47 15 59.9",10.43,9.74,"B1V            ","B1","V         ",328.37018699999999,47.266638999999998,1.2599999999999998]
["BD+61 2214","","*iC",null,"",328.37352900000002,"21 53 29.6",62.598286000000002,"+62 35 53.82",10.1,9.84,"B5V             ","B5","V         ",328.37352900000002,62.598286000000002,1.1600000000000001]
["BD+61 2214","","*iC",null,"",328.37352900000002,"21 53 29.6",62.598286000000002,"+62 35 53.82",10.1,9.84,"B5V             ","B5","V         ",328.37352900000002,62.598286000000002,1.1600000000000001]
["BD+61 2215","","*iC","","",328.39194709999998,"21 53 34",62.598545000000001,"+62 35 54.76",9.3699999999999992,9.25,"B3V            ","B3","V         ",328.39194709999998,62.598545000000001,1.75]
["HD 208220                ",{"$f":"IF(LEFT(A2363,2)=\"V*\",\"var\",\"\")","v":""},"Be*","","Be",328.43164460000003,"21 53 43.5",43.482827499999999," 43 28 58.17",9.4600000000000009,9.4499999999999993,"B1IVe          ","B1","IVe       ",328.43164460000003,43.482827499999999,1.5500000000000007]
["HD 208392","","Be*","","Be",328.45043134000002,"21 53 48.1",62.614427800000001,"+62 36 51.94",7.2,7.03,"B0.5V+...      ","B0","V+...     ",328.45043134000002,62.614427800000001,3.9699999999999998]
["HD 208440                ",{"$f":"IF(LEFT(A2365,2)=\"V*\",\"var\",\"\")","v":""},"*i*","","",328.47207351999998,"21 53 53.2",62.600208469999998," 62 36 0.75",7.93,7.91,"B1V            ","B1","V         ",328.47207351999998,62.600208469999998,3.09]
["HD 208340","","Pe*",null,"",328.55407919999999,"21 54 12.9",52.985233299999997,"+52 59 6.83",8.89,8.92,"B9p            ","B9","p         ",328.55407919999999,52.985233299999997,2.08]
["HR 8375","","Be*","","Be",328.87916566000001,"21 55 30.9",65.320809499999996,"+65 19 14.91",5.8419999999999996,5.9390000000000001,"B2.5Ve         ","B2","Ve        ",328.87916566000001,65.320809499999996,5.0609999999999999]
["HD 208761","","*  ",null,"",329.06674149999998,"21 56 16",62.894633030000001,"+62 53 40.67",7.68,7.64,"B3V            ",{"$f":"+LEFT(L2368,2)","v":"B3"},{"$f":"+IF(MID(L2368,3,1)=\".\",MID(L2368,5,10),MID(L2368,3,10))","v":"V         "},329.06674149999998,62.894633030000001,3.3600000000000003]
["BD+45 3736","","*  ","","",329.14291789999999,"21 56 34.3",46.1479122,"+46 8 52.48",9.0500000000000007,9.01,"B9p            ","B9","p         ",329.14291789999999,46.1479122,1.9900000000000002]
["HD 208904","","*  ","","",329.22420443999999,"21 56 53.8",65.593496909999999,"+65 35 36.58",7.49,7.52,"B3V            ","B3","V         ",329.22420443999999,65.593496909999999,{"$f":"11-K2370","v":3.4800000000000004}]
["V2173 Cyg","Var","LP*",null,"",329.25926959999998,"21 57 2.2",48.668564979999999,"+48 40 6.83",6.4260000000000002,6.5,"B8V            ","B8","V         ",{"$f":"+F2371","v":329.25926959999998},{"$f":"+H2371","v":48.668564979999999},4.5]
["HR 8384","","Al*","","",329.29625117000001,"21 57 11.1",66.156153349999997,"+66 9 22.15",6.3440000000000003,6.4,"B2V            ","B2","V         ",329.29625117000001,66.156153349999997,4.5999999999999996]
["HD 208905                ",{"$f":"IF(LEFT(A2373,2)=\"V*\",\"var\",\"\")","v":""},"*  ","","",329.32361098000001,"21 57 17.6",61.29531188," 61 17 43.12",7.0449999999999999,7.0049999999999999,"B1Vp...        ","B1","Vp...     ",329.32361098000001,61.29531188,3.9950000000000001]
["HD 208835","","*  ",null,"",329.46399000999997,"21 57 51.3",46.864441630000002,"+46 51 51.98",7.46,7.5,"B8III          ","B8","III       ",329.46399000999997,46.864441630000002,3.5]
["MR Cyg","Var","Al*",null,"",329.73579346999998,"21 58 56.5",47.983336860000001,"+47 59 0.01",8.89,8.91,"B3V            ","B3","V         ",329.73579346999998,47.983336860000001,2.09]
["HD 209162","","*  ",null,"",329.76487397,"21 59 3.5",63.262819270000001,"+63 15 46.14",8.74,8.6199999999999992,"B8V            ","B8","V         ",329.76487397,63.262819270000001,2.3800000000000008]
["HD 209178","","*  ",null,"",329.76549877000002,"21 59 3.7",63.998669110000002,"+63 59 55.2",8.9700000000000006,8.8000000000000007,"B8V            ","B8","V         ",329.76549877000002,63.998669110000002,2.1999999999999993]
["HD 208973","","*  ","","",329.79797149000001,"21 59 11.5",33.630749340000001,"+33 37 50.69",8.1199999999999992,8.1999999999999993,"B2V            ","B2","V         ",329.79797149000001,33.630749340000001,2.8000000000000007]
["HD 209145                ",{"$f":"IF(LEFT(A2379,2)=\"V*\",\"var\",\"\")","v":""},"Be*","","Be",329.83195436,"21 59 19.6",60.297664670000003," 60 17 51.59",7.92,7.67,"B1V            ","B1","V         ",329.83195436,60.297664670000003,3.33]
["CS Lac","Var","bL*",null,"",329.92802169999999,"21 59 42.7",42.571015000000003,"+42 34 15.65",9.61,9.52,"B5V             ","B5","V         ",329.92802169999999,42.571015000000003,1.4800000000000004]
["CS Lac","Var","bL*",null,"",329.92802169999999,"21 59 42.7",42.571015000000003,"+42 34 15.65",9.61,9.52,"B5V             ","B5","V         ",329.92802169999999,42.571015000000003,1.4800000000000004]
["HD 209059","","*  ",null,"",330.02779456000002,"22 0 6.6",26.783827800000001,"+26 47 1.78",7.7,7.73,"B9V            ","B9","V         ",330.02779456000002,26.783827800000001,3.2699999999999996]
["18 Peg","","*  ","","",330.03302817999997,"22 0 7.9",6.71743778,"+6 43 2.77",5.8780000000000001,5.9880000000000004,"B3III          ","B3","III       ",330.03302817999997,6.71743778,5.0119999999999996]
["HR 8399","","*  ","","",330.16360228999997,"22 0 39.2",62.487796090000003,"+62 29 16.06",6.7009999999999996,6.6920000000000002,"B0IV           ","B0","IV        ",330.16360228999997,62.487796090000003,4.3079999999999998]
["HD 209296","","Em*","Em","",330.16788529000002,"22 0 40.2",56.710627289999998,"+56 42 38.25",8.51,8.2899999999999991,"B6V:N          ","B6","V:N       ",330.16788529000002,56.710627289999998,2.7100000000000009]
["HD 209308","","Pe*",null,"",330.2341217,"22 0 56.1",54.159951100000001,"+54 9 35.82",9.0500000000000007,9.1300000000000008,"B9p            ","B9","p         ",330.2341217,54.159951100000001,1.8699999999999992]
["HD 209454","","*  ","","",330.35715206999998,"22 1 25.7",61.556102090000003,"+61 33 21.96",7.9,7.77,"B2V            ","B2","V         ",330.35715206999998,61.556102090000003,3.2300000000000004]
["HR 8403","","*  ",null,"",330.46078224000001,"22 1 50.5",52.882253599999999,"+52 52 56.11",5.6689999999999996,5.7729999999999997,"B5III           ","B5","III       ",330.46078224000001,52.882253599999999,5.2270000000000003]
["HR 8403","","*  ",null,"",330.46078224000001,"22 1 50.5",52.882253599999999,"+52 52 56.11",5.6689999999999996,5.7729999999999997,"B5III           ","B5","III       ",330.46078224000001,52.882253599999999,5.2270000000000003]
["HR 8397","","V* ",null,"",330.50572762000002,"22 2 1.3",10.973805430000001,"+10 58 25.69",6.2430000000000003,6.3579999999999997,"B5IIIn          ","B5","IIIn      ",330.50572762000002,10.973805430000001,4.6420000000000003]
["HR 8397","","V* ",null,"",330.50572762000002,"22 2 1.3",10.973805430000001,"+10 58 25.69",6.2430000000000003,6.3579999999999997,"B5IIIn          ","B5","IIIn      ",330.50572762000002,10.973805430000001,4.6420000000000003]
["HD 209469","","*  ",null,"",330.68480111000002,"22 2 44.3",42.814511940000003,"+42 48 52.24",7.16,7.2069999999999999,"B9V            ","B9","V         ",330.68480111000002,42.814511940000003,3.7930000000000001]
["15 Cep                 ",{"$f":"IF(LEFT(A2393,2)=\"V*\",\"var\",\"\")","v":""},"*i*","","",330.97440945,"22 3 53.8",59.814575599999998," 59 48 52.47",6.8659999999999997,6.7080000000000002,"B1V            ","B1","V         ",330.97440945,59.814575599999998,4.2919999999999998]
["HD 209664","","*  ",null,"",331.00468790000002,"22 4 1.1",45.273363099999997,"+45 16 24.1",8.82,8.7899999999999991,"B9p            ","B9","p         ",331.00468790000002,45.273363099999997,2.2100000000000009]
["BD+51 3239","","*  ","","",331.02752579999998,"22 4 6.6",52.097760000000001,"+52 5 51.93",9.98,9.91,"B2V            ","B2","V         ",331.02752579999998,52.097760000000001,1.0899999999999999]
["23 Peg","","*  ",null,"",331.39447576999999,"22 5 34.6",28.963977589999999,"+28 57 50.31",5.64,5.7,"B9Vn           ","B9","Vn        ",331.39447576999999,28.963977589999999,5.3]
["V365 Lac","Var","El*","","",331.46341331999997,"22 5 51.2",48.231492289999998,"+48 13 53.37",6.17,6.2569999999999997,"B2V            ","B2","V         ",331.46341331999997,48.231492289999998,4.7430000000000003]
["BD+49 3735","","Be*","","Be",331.53480438999998,"22 6 8.3",49.902441170000003,"+49 54 8.78",9.74,9.69,"B1.5V:nne...   ","B1","V:nne...  ",331.53480438999998,49.902441170000003,1.3100000000000005]
["25 Peg","","Be*",null,"Be",331.95959986999998,"22 7 50.3",21.702925520000001,"+21 42 10.53",5.7069999999999999,5.7830000000000004,"B7Vne          ","B7","Vne       ",331.95959986999998,21.702925520000001,5.2169999999999996]
["BD+53 2790","","HXB","","",331.98432209999999,"22 7 56.2",54.5184456,"+54 31 6.4",10.14,9.93,"O9.5IIIe         ","O9","IIIe      ",331.98432209999999,54.5184456,1.0700000000000003]
["HD 210386","","*  ","","",332.00116637999997,"22 8 0.2",63.735555599999998,"+63 44 8",8.27,8.02,"B1.5II-III     ","B1","II-III    ",332.00116637999997,63.735555599999998,2.9800000000000004]
["V446 Cep              ","var","Al*","","",332.18998203000001,"22 8 45.5",61.022418250000001," 61 1 20.7",7.4,7.32,"B1V            ","B1","V         ",332.18998203000001,61.022418250000001,3.6799999999999997]
["BD+52 3122               ",{"$f":"IF(LEFT(A2403,2)=\"V*\",\"var\",\"\")","v":""},"*  ","","",332.19558869999997,"22 8 46.9",52.974343599999997," 52 58 27.63",9.5500000000000007,9.36,"B1V:           ","B1","V:        ",332.19558869999997,52.974343599999997,1.6400000000000006]
["BD+72 1018","","*iN",null,"",332.2854246,"22 9 8.5",72.884714399999993,"+72 53 4.97",10.210000000000001,9.7899999999999991,"B8V            ","B8","V         ",332.2854246,72.884714399999993,1.2100000000000009]
["V402 Lac","Var","Al*",null,"",332.31332913,"22 9 15.1",44.846479789999997,"+44 50 47.32",6.6920000000000002,6.7290000000000001,"B9IV           ","B9","IV        ",332.31332913,44.846479789999997,4.2709999999999999]
["HD 210806","","*iN",null,"",332.4171892,"22 9 40.1",73.390896569999995,"+73 23 27.22",8.42,8.35,"B8IV           ","B8","IV        ",332.4171892,73.390896569999995,2.6500000000000004]
["HR 8473","","*  ",null,"",332.56374717,"22 10 15.2",72.111264329999997,"+72 6 40.55",6.3040000000000003,6.351,"B9mnp...       ","B9","mnp...    ",332.56374717,72.111264329999997,4.649]
["BD+55 2696","","*  ",null,"",332.5980692,"22 10 23.5",56.2159561,"+56 12 57.44",10.130000000000001,9.8699999999999992,"B9III          ","B9","III       ",332.5980692,56.2159561,1.1300000000000008]
["BD+52 3127","","Pe*","","",332.61647499999998,"22 10 27.9",52.800381000000002,"+52 48 1.37",9.9700000000000006,9.8699999999999992,"B9p            ","B9","p         ",332.61647499999998,52.800381000000002,1.1300000000000008]
["BD+54 2705","","*  ",null,"",333.20105539999997,"22 12 48.2",55.135832800000003,"+55 8 8.99",9.9700000000000006,9.8699999999999992,"B5V             ","B5","V         ",333.20105539999997,55.135832800000003,1.1300000000000008]
["BD+54 2705","","*  ",null,"",333.20105539999997,"22 12 48.2",55.135832800000003,"+55 8 8.99",9.9700000000000006,9.8699999999999992,"B5V             ","B5","V         ",333.20105539999997,55.135832800000003,1.1300000000000008]
["HD 211057","","*  ",null,"",333.31215731999998,"22 13 14.9",55.313775059999998,"+55 18 49.59",7.7,7.65,"B9V            ","B9","V         ",333.31215731999998,55.313775059999998,3.3499999999999996]
["BD+53 2820","","*  ","","",333.45706330000002,"22 13 49.6",54.409740300000003,"+54 24 35.06",10.02,9.9600000000000009,"B0IVn          ","B0","IVn       ",333.45706330000002,54.409740300000003,1.0399999999999991]
["HR 8490","","*  ",null,"",333.45710207000002,"22 13 49.7",63.16233742,"+63 9 44.41",6.0369999999999999,6.125,"B8Vn           ","B8","Vn        ",333.45710207000002,63.16233742,4.875]
["HD 211210","","*iC",null,"",333.61345011999998,"22 14 27.2",49.871589419999999,"+49 52 17.72",8.56,8.4700000000000006,"B5III           ","B5","III       ",333.61345011999998,49.871589419999999,2.5299999999999994]
["HD 211210","","*iC",null,"",333.61345011999998,"22 14 27.2",49.871589419999999,"+49 52 17.72",8.56,8.4700000000000006,"B5III           ","B5","III       ",333.61345011999998,49.871589419999999,2.5299999999999994]
["HD 211263","","V* ",null,"",333.67930796000002,"22 14 43",49.860844610000001,"+49 51 39.04",8.7799999999999994,8.7100000000000009,"B7IV           ","B7","IV        ",333.67930796000002,49.860844610000001,2.2899999999999991]
["HD 239900","","*  ","","",333.69552290000001,"22 14 46.9",56.866255000000002,"+56 51 58.51",9.1999999999999993,9.0500000000000007,"B9V            ","B9","V         ",333.69552290000001,56.866255000000002,1.9499999999999993]
["BD+49 3788","","*i*",null,"",333.76303580000001,"22 15 3.1",49.877930599999999,"+49 52 40.55",9.44,9.36,"B8V            ","B8","V         ",333.76303580000001,49.877930599999999,1.6400000000000006]
["HD 211337","","*i*",null,"",333.79423709999998,"22 15 10.6",49.8753083,"+49 52 31.1",9.39,9.25,"B9V            ","B9","V         ",333.79423709999998,49.8753083,1.75]
["BD+49 3790B","","*i*",null,"",333.7950242,"22 15 10.8",49.877857499999998,"+49 52 40.28",9.68,9.67,"B8V            ","B8","V         ",333.7950242,49.877857499999998,1.33]
["BD+55 2707","","*  ",null,"",333.79627454000001,"22 15 11.1",55.918478020000002,"+55 55 6.52",10.14,9.98,"B9Vp           ","B9","Vp        ",333.79627454000001,55.918478020000002,1.0199999999999996]
["HD 211430","","*  ",null,"",333.87249030999999,"22 15 29.3",55.818565820000003,"+55 49 6.83",7.42,7.47,"B9V            ","B9","V         ",333.87249030999999,55.818565820000003,3.5300000000000002]
["BD+49 3796","","*iC",null,"",333.97939580000002,"22 15 55",49.906453300000003,"+49 54 23.23",9.31,9.25,"B9V            ","B9","V         ",333.97939580000002,49.906453300000003,1.75]
["BD+49 3797","","*iC",null,"",334.00121580000001,"22 16 0.2",49.946495599999999,"+49 56 47.38",9.31,9.3000000000000007,"B8III          ","B8","III       ",334.00121580000001,49.946495599999999,1.6999999999999993]
["BD+53 2837","","*  ","","",334.27722370999999,"22 17 6.5",54.209279410000001,"+54 12 33.4",10.26,9.9600000000000009,"B2V:           ","B2","V:        ",334.27722370999999,54.209279410000001,1.0399999999999991]
["HD 211774","","*  ",null,"",334.51729668000002,"22 18 4.1",55.281471279999998,"+55 16 53.29",9.08,8.89,"B9V            ","B9","V         ",334.51729668000002,55.281471279999998,2.1099999999999994]
["HD 211880","","*i*","","",334.61585255,"22 18 27.8",63.222908349999997,"+63 13 22.47",7.99,7.75,"B0.5V          ","B0","V         ",334.61585255,63.222908349999997,3.25]
["TYC 3990-2043-1","","*  ",null,"",334.65258790000001,"22 18 36.6",56.324838100000001,"+56 19 29.41",9.91,9.7799999999999994,"B7III          ","B7","III       ",334.65258790000001,56.324838100000001,1.2200000000000006]
["BD+60 2380","","*  ","","",334.7617467,"22 19 2.8",60.767044200000001,"+60 46 1.35",9.36,9.06,"B2III          ","B2","III       ",334.7617467,60.767044200000001,1.9399999999999995]
["30 Peg","","V* ",null,"",335.11490170000002,"22 20 27.5",5.7894990799999997,"+5 47 22.19",5.34,5.37,"B5IV            ","B5","IV        ",335.11490170000002,5.7894990799999997,5.63]
["30 Peg","","V* ",null,"",335.11490170000002,"22 20 27.5",5.7894990799999997,"+5 47 22.19",5.34,5.37,"B5IV            ",{"$f":"+LEFT(L2432,2)","v":"B5"},{"$f":"+IF(MID(L2432,3,1)=\".\",MID(L2432,5,10),MID(L2432,3,10))","v":"IV        "},335.11490170000002,5.7894990799999997,5.63]
["2 Lac","","El*",null,"",335.25644693999999,"22 21 1.5",46.536568350000003,"+46 32 11.64",4.4509999999999996,4.5510000000000002,"B6V            ","B6","V         ",335.25644693999999,46.536568350000003,6.4489999999999998]
["HD 212183","","*  ",null,"",335.26620565000002,"22 21 3.8",55.98583034,"+55 59 8.98",7.94,7.97,"B9III-IV       ","B9","III-IV    ",335.26620565000002,55.98583034,{"$f":"11-K2434","v":3.0300000000000002}]
["HD 235807","","*  ","","",335.29056118,"22 21 9.7",55.551068819999998,"+55 33 3.84",9.74,9.5399999999999991,"B0.5IV:n       ","B0","IV:n      ",{"$f":"+F2435","v":335.29056118},{"$f":"+H2435","v":55.551068819999998},1.4600000000000009]
["32 Peg","","*i*",null,"",335.33058062999999,"22 21 19.3",28.330528520000001,"+28 19 49.9",4.7830000000000004,4.806,"B9III          ","B9","III       ",335.33058062999999,28.330528520000001,6.194]
["31 Peg","","Be*","","Be",335.37947960999998,"22 21 31",12.20518412,"+12 12 18.66",4.72,4.8099999999999996,"B2IV-Ve        ","B2","IV-Ve     ",335.37947960999998,12.20518412,6.19]
["V405 Lac","Var","LP*",null,"",335.46196387999998,"22 21 50.8",42.078157419999997,"+42 4 41.36",6.282,6.367,"B5V             ","B5","V         ",335.46196387999998,42.078157419999997,4.633]
["V405 Lac","Var","LP*",null,"",335.46196387999998,"22 21 50.8",42.078157419999997,"+42 4 41.36",6.282,6.367,"B5V             ","B5","V         ",335.46196387999998,42.078157419999997,4.633]
["BD+57 2513","","*i*","","",335.510808,"22 22 2.5",58.719310999999998,"+58 43 9.51",10.199999999999999,9.6300000000000008,"O9.5V            ","O9","V         ",335.510808,58.719310999999998,1.3699999999999992]
["HD 235813","","*  ","","",335.56094359000002,"22 22 14.6",54.800353129999998,"+54 48 1.27",9,8.8699999999999992,"B0III          ","B0","III       ",335.56094359000002,54.800353129999998,2.1300000000000008]
["HR 8535","","*  ",null,"",335.75078080999998,"22 23 0.1",57.284613389999997,"+57 17 4.6",6.0590000000000002,6.1689999999999996,"B8III-IV       ","B8","III-IV    ",335.75078080999998,57.284613389999997,4.8310000000000004]
["HD 212442","","*  ","","",336.00205332000002,"22 24 0.4",15.28147489,"+15 16 53.3",6.7140000000000004,6.7789999999999999,"B9V            ","B9","V         ",336.00205332000002,15.28147489,4.2210000000000001]
["* 52 Aqr                 ",{"$f":"IF(LEFT(A2444,2)=\"V*\",\"var\",\"\")","v":""},"Be*","","Be",336.31926188,"22 25 16.6",1.3773985," 1 22 38.63",4.6260000000000003,4.7939999999999996,"B1Ve           ","B1","Ve        ",336.31926188,1.3773985,6.2060000000000004]
["BD+54 2775               ",{"$f":"IF(LEFT(A2445,2)=\"V*\",\"var\",\"\")","v":""},"*  ","","",336.52086500000001,"22 26 5",55.4683408," 55 28 6.02",9.82,9.6,"B1V            ","B1","V         ",336.52086500000001,55.4683408,1.4000000000000004]
["HR 8549","","*i*","","",336.68982591999998,"22 26 45.5",37.443705729999998,"+37 26 37.34",6.33,6.46,"B2V            ","B2","V         ",336.68982591999998,37.443705729999998,4.54]
["HR 8554","","*  ",null,"",336.74657207000001,"22 26 59.1",56.433562180000003,"+56 26 0.82",6.4809999999999999,6.5780000000000003,"B5III           ","B5","III       ",336.74657207000001,56.433562180000003,4.4219999999999997]
["HR 8554","","*  ",null,"",336.74657207000001,"22 26 59.1",56.433562180000003,"+56 26 0.82",6.4809999999999999,6.5780000000000003,"B5III           ","B5","III       ",336.74657207000001,56.433562180000003,4.4219999999999997]
["HD 239954","","*  ",null,"",336.77684053000002,"22 27 6.4",57.49199402,"+57 29 31.17",9.49,9.2799999999999994,"B5V             ","B5","V         ",336.77684053000002,57.49199402,1.7200000000000006]
["HD 239954","","*  ",null,"",336.77684053000002,"22 27 6.4",57.49199402,"+57 29 31.17",9.49,9.2799999999999994,"B5V             ","B5","V         ",336.77684053000002,57.49199402,1.7200000000000006]
["HD 239955","","*  ",null,"",336.809438,"22 27 14.2",57.827717,"+57 49 39.78",9.8800000000000008,9.6300000000000008,"B8V            ","B8","V         ",336.809438,57.827717,1.3699999999999992]
["HD 239956","","*  ",null,"",336.82154688000003,"22 27 17.1",58.94189343,"+58 56 30.81",9.6199999999999992,9.23,"B9V            ","B9","V         ",336.82154688000003,58.94189343,1.7699999999999996]
["HR 8553","","*  ","","",336.86040922000001,"22 27 26.4",39.81002453,"+39 48 36.08",6,6.16,"B2V            ","B2","V         ",336.86040922000001,39.81002453,4.84]
["HD 213209","","*i*",null,"",337.09994358,"22 28 23.9",57.661832949999997,"+57 39 42.59",8.52,8.27,"B9V            ","B9","V         ",337.09994358,57.661832949999997,2.7300000000000004]
["BD+55 2757","","*  ","","",337.29311869999998,"22 29 10.3",56.567266099999998,"+56 34 2.15",10.38,9.9,"B2V            ","B2","V         ",337.29311869999998,56.567266099999998,1.0999999999999996]
["HD 213405","","*  ","","",337.32306082999997,"22 29 17.5",65.113327839999997,"+65 6 47.98",8.39,8.02,"B0.5V          ","B0","V         ",337.32306082999997,65.113327839999997,2.9800000000000004]
["HD 213322","","*  ","","",337.34308356000003,"22 29 22.3",54.245915289999999,"+54 14 45.29",6.7320000000000002,6.7809999999999997,"B2IV           ","B2","IV        ",337.34308356000003,54.245915289999999,4.2190000000000003]
["HD 213571","","*  ","","",337.50144726000002,"22 30 0.3",70.171462219999995,"+70 10 17.26",7.09,7.1479999999999997,"B2IV           ","B2","IV        ",337.50144726000002,70.171462219999995,3.8520000000000003]
["V413 Lac","Var","El*","","",337.52388689999998,"22 30 5.7",54.790160540000002,"+54 47 24.57",9.9600000000000009,9.82,"B0IVn          ","B0","IVn       ",337.52388689999998,54.790160540000002,1.1799999999999997]
["6 Lac","","*  ","","",337.62191686,"22 30 29.2",43.123376790000002,"+43 7 24.15",4.4210000000000003,4.5179999999999998,"B2IV           ","B2","IV        ",337.62191686,43.123376790000002,6.4820000000000002]
["HD 239984","","*  ",null,"",337.69328289999999,"22 30 46.3",57.419753100000001,"+57 25 11.11",9.33,9.1199999999999992,"B9V            ","B9","V         ",337.69328289999999,57.419753100000001,1.8800000000000008]
["TYC 3991-1436-1","","*  ","","",337.70123289999998,"22 30 48.2",56.605004700000002,"+56 36 18.01",10.49,9.89,"B0IV           ","B0","IV        ",337.70123289999998,56.605004700000002,1.1099999999999994]
["BD+60 2405","","Be*","","Be",337.79137120000001,"22 31 9.9",61.609516399999997,"+61 36 34.25",10.37,9.93,"B3V:nn         ","B3","V:nn      ",337.79137120000001,61.609516399999997,1.0700000000000003]
["BD+64 1677","","*i*","","",337.80657015000003,"22 31 13.5",65.466244810000006,"+65 27 58.48",9.52,9,"B2IV...        ","B2","IV...     ",337.80657015000003,65.466244810000006,2]
["HD 235871","","*i*",null,"",337.97438169999998,"22 31 53.8",55.451285599999999,"+55 27 4.62",9.4,9.31,"B9V            ","B9","V         ",337.97438169999998,55.451285599999999,1.6899999999999995]
["HD 213757                ",{"$f":"IF(LEFT(A2466,2)=\"V*\",\"var\",\"\")","v":""},"*  ","","",338.08986320000002,"22 32 21.5",60.33458349," 60 20 4.5",8.6,8.4,"B1V            ","B1","V         ",338.08986320000002,60.33458349,2.5999999999999996]
["XZ Cep","Var","bL*","","",338.10450456000001,"22 32 25",67.150685089999996,"+67 9 2.46",9.2200000000000006,8.51,"O9.5V            ","O9","V         ",338.10450456000001,67.150685089999996,2.4900000000000002]
["HD 235874","","*  ",null,"",338.24894465,"22 32 59.7",51.215591240000002,"+51 12 56.12",9.6199999999999992,9.58,"B3III          ","B3","III       ",338.24894465,51.215591240000002,1.42]
["HD 235877","","*i*",null,"",338.31257620000002,"22 33 15",54.765078099999997,"+54 45 54.28",9.11,9.01,"B9V            ","B9","V         ",338.31257620000002,54.765078099999997,1.9900000000000002]
["HD 213801","","*  ","","",338.34778247000003,"22 33 23.4",39.575153049999997,"+39 34 30.55",8.1199999999999992,8.17,"B9V            ","B9","V         ",338.34778247000003,39.575153049999997,2.83]
["HD 235880","","*  ",null,"",338.35381539999997,"22 33 24.9",54.155929999999998,"+54 9 21.34",9.56,9.39,"B9III          ","B9","III       ",338.35381539999997,54.155929999999998,1.6099999999999994]
["BD+55 2770","","*  ","","",338.43970400000001,"22 33 45.5",56.532989000000001,"+56 31 58.76",10.02,9.76,"B1.5III        ","B1","III       ",338.43970400000001,56.532989000000001,1.2400000000000002]
["BD+55 2771               ",{"$f":"IF(LEFT(A2473,2)=\"V*\",\"var\",\"\")","v":""},"*  ","","",338.54698330000002,"22 34 11.2",56.693907199999998," 56 41 38.06",10.1,9.83,"B1IV           ","B1","IV        ",338.54698330000002,56.693907199999998,1.17]
["HD 213976","","*  ","","",338.62577749000002,"22 34 30.1",40.774899089999998,"+40 46 29.63",6.8819999999999997,6.9989999999999997,"B1.5V          ","B1","V         ",338.62577749000002,40.774899089999998,4.0010000000000003]
["HD 214022","","*  ",null,"",338.71027193999998,"22 34 50.4",40.732543540000002,"+40 43 57.15",8.4499999999999993,8.51,"B7V            ","B7","V         ",338.71027193999998,40.732543540000002,2.4900000000000002]
["HD 240002","","*  ",null,"",338.7894167,"22 35 9.4",56.228852199999999,"+56 13 43.86",10.050000000000001,9.82,"B5V             ","B5","V         ",338.7894167,56.228852199999999,1.1799999999999997]
["HD 240002","","*  ",null,"",338.7894167,"22 35 9.4",56.228852199999999,"+56 13 43.86",10.050000000000001,9.82,"B5V             ","B5","V         ",338.7894167,56.228852199999999,1.1799999999999997]
["HD 214168","","*i*","","",338.96711542000003,"22 35 52.1",39.62813397,"+39 37 41.28",6.32,6.48,"B2V            ","B2","V         ",338.96711542000003,39.62813397,4.5199999999999996]
["HR 8603","","Be*","","Be",338.96785176999998,"22 35 52.2",39.634328609999997,"+39 38 3.58",5.58,5.73,"B2Ve           ","B2","Ve        ",338.96785176999998,39.634328609999997,5.27]
["HR 8606","","*  ",null,"",338.97242742999998,"22 35 53.3",50.070786939999998,"+50 4 14.83",6.2110000000000003,6.2809999999999997,"B3V            ","B3","V         ",338.97242742999998,50.070786939999998,4.7190000000000003]
["HD 214243","","*  ",null,"",339.06944688999999,"22 36 16.6",40.08876918,"+40 5 19.56",8.2100000000000009,8.31,"B6IV           ","B6","IV        ",339.06944688999999,40.08876918,2.6899999999999995]
["HD 214263","","*  ","","",339.09302656,"22 36 22.3",37.84222398,"+37 50 32",6.7050000000000001,6.835,"B2V            ","B2","V         ",339.09302656,37.84222398,4.165]
["HD 214432","","*  ","","",339.36967764000002,"22 37 28.7",39.438867070000001,"+39 26 19.92",7.47,7.57,"B3V            ","B3","V         ",339.36967764000002,39.438867070000001,3.4299999999999997]
["HD 214930","","PM*","","",340.35720793000002,"22 41 25.7",23.84657734,"+23 50 47.67",7.27,7.4,"B2IV           ","B2","IV        ",340.35720793000002,23.84657734,3.5999999999999996]
["zet Peg","","*i*",null,"",340.36554999999998,"22 41 27.7",10.831289,"+10 49 52.64",3.3130000000000002,3.39,"B8V            ","B8","V         ",340.36554999999998,10.831289,7.6099999999999994]
["DD Lac","Var","bC*","","",340.36937639000001,"22 41 28.6",40.225450100000003,"+40 13 31.62",5.0860000000000003,5.2279999999999998,"B2III          ","B2","III       ",340.36937639000001,40.225450100000003,5.7720000000000002]
["BD+55 2795               ",{"$f":"IF(LEFT(A2487,2)=\"V*\",\"var\",\"\")","v":""},"*  ","","",340.688354,"22 42 45.2",56.346183000000003," 56 20 46.25",10.08,9.77,"B1III          ","B1","III       ",340.688354,56.346183000000003,1.2300000000000004]
["HR 8651                  ",{"$f":"IF(LEFT(A2488,2)=\"V*\",\"var\",\"\")","v":""},"*  ","","",340.73102972999999,"22 42 55.4",37.802733879999998," 37 48 9.84",6.2990000000000004,6.4180000000000001,"B1V            ","B1","V         ",340.73102972999999,37.802733879999998,4.5819999999999999]
["HD 215211","","*  ",null,"",340.76396870999997,"22 43 3.3",38.768638109999998,"+38 46 7.09",8.59,8.61,"B8V            ","B8","V         ",340.76396870999997,38.768638109999998,2.3900000000000006]
["HD 215371","","*  ","","",340.76824877000001,"22 43 4.3",65.33625232,"+65 20 10.5",6.726,6.7649999999999997,"B1.5V          ","B1","V         ",340.76824877000001,65.33625232,4.2350000000000003]
["BD+53 2964","","Be*","","Be",340.8466717,"22 43 23.2",54.071598899999998,"+54 4 17.75",9.49,9.4700000000000006,"B2IV:nnpe      ","B2","IV:nnpe   ",340.8466717,54.071598899999998,1.5299999999999994]
["ZZ Cep","Var","Al*",null,"",341.26087697999998,"22 45 2.6",68.132885529999996,"+68 7 58.38",9.3000000000000007,8.6,"B7v+...        ","B7","v+...     ",341.26087697999998,68.132885529999996,2.4000000000000004]
["HD 240047","","*  ","","",341.33522210000001,"22 45 20.4",57.432312199999998,"+57 25 56.32",10.08,9.9,"B2III          ","B2","III       ",341.33522210000001,57.432312199999998,1.0999999999999996]
["BD+55 2808","","*  ","","",341.61050829999999,"22 46 26.5",56.323526399999999,"+56 19 24.69",10.3,9.98,"B2III          ","B2","III       ",341.61050829999999,56.323526399999999,1.0199999999999996]
["HD 215836                ",{"$f":"IF(LEFT(A2495,2)=\"V*\",\"var\",\"\")","v":""},"V* ","","",341.76005959999998,"22 47 2.4",56.431762200000001," 56 25 54.34",9.6,9.2100000000000009,"B1IIv          ","B1","IIv       ",341.76005959999998,56.431762200000001,1.7899999999999991]
["HD 215868","","*  ",null,"",341.78531329999998,"22 47 8.4",57.595103100000003,"+57 35 42.37",8.3800000000000008,8.41,"B9V            ",{"$f":"+LEFT(L2496,2)","v":"B9"},{"$f":"+IF(MID(L2496,3,1)=\".\",MID(L2496,5,10),MID(L2496,3,10))","v":"V         "},341.78531329999998,57.595103100000003,2.59]
["HD 240068","","SB*","","",341.82754,"22 47 18.6",58.489060000000002,"+58 29 20.61",10.14,9.67,"B0III          ","B0","III       ",341.82754,58.489060000000002,1.33]
["AH Cep","Var","bL*","","",341.97059462999999,"22 47 52.9",65.062166469999994,"+65 3 43.79",7.1,6.88,"B0.5V+...      ","B0","V+...     ",341.97059462999999,65.062166469999994,{"$f":"11-K2498","v":4.12}]
["HD 216044","","Be*","","Be",342.18032340000002,"22 48 43.2",55.126044569999998,"+55 7 33.76",8.5500000000000007,8.52,"B0III-IV       ","B0","III-IV    ",{"$f":"+F2499","v":342.18032340000002},{"$f":"+H2499","v":55.126044569999998},2.4800000000000004]
["HR 8682","","Be*",null,"Be",342.19956552000002,"22 48 47.8",54.414892770000002,"+54 24 53.61",6.048,6.1310000000000002,"B5Vne           ","B5","Vne       ",342.19956552000002,54.414892770000002,4.8689999999999998]
["HR 8682","","Be*",null,"Be",342.19956552000002,"22 48 47.8",54.414892770000002,"+54 24 53.61",6.048,6.1310000000000002,"B5Vne           ","B5","Vne       ",342.19956552000002,54.414892770000002,4.8689999999999998]
["V* V422 Lac              ",{"$f":"IF(LEFT(A2502,2)=\"V*\",\"var\",\"\")","v":"var"},"Ir*","","",342.32365620000002,"22 49 17.6",47.9300718," 47 55 48.25",7.78,7.85,"B1V            ","B1","V         ",342.32365620000002,47.9300718,3.1500000000000004]
["BD+61 2350               ",{"$f":"IF(LEFT(A2503,2)=\"V*\",\"var\",\"\")","v":""},"*iA","","",342.40187793000001,"22 49 36.4",62.332765780000003," 62 19 57.95",9.7899999999999991,9.23,"B1V            ","B1","V         ",342.40187793000001,62.332765780000003,1.7699999999999996]
["V360 Lac","Var","bL*","","",342.59072767999999,"22 50 21.7",41.953393910000003,"+41 57 12.21",5.9809999999999999,5.9279999999999999,"B3IV:eaV       ","B3","IV:eaV    ",342.59072767999999,41.953393910000003,5.0720000000000001]
["BD+61 2355","","Be*",null,"Be",343.12162419999999,"22 52 29.1",62.686058099999997,"+62 41 9.8",9.9,9.6300000000000008,"B7IV           ","B7","IV        ",343.12162419999999,62.686058099999997,1.3699999999999992]
["BD+61 2357               ",{"$f":"IF(LEFT(A2506,2)=\"V*\",\"var\",\"\")","v":""},"*  ","","",343.14060790000002,"22 52 33.7",62.31326," 62 18 47.73",11.04,9.9600000000000009,"B1V            ","B1","V         ",343.14060790000002,62.31326,1.0399999999999991]
["BD+61 2357A              ",{"$f":"IF(LEFT(A2507,2)=\"V*\",\"var\",\"\")","v":""},"*i*","","",343.14063299999998,"22 52 33.7",62.313263999999997," 62 18 47.75",11.03,9.84,"B1V            ","B1","V         ",343.14063299999998,62.313263999999997,1.1600000000000001]
["BD+62 2125","","*iA","","",343.20916385999999,"22 52 50.1",63.413441329999998,"+63 24 48.38",9.57,9.0299999999999994,"B1.5V          ","B1","V         ",343.20916385999999,63.413441329999998,1.9700000000000006]
["HR 8705","","*  ",null,"",343.21770408999998,"22 52 52.2",50.412284849999999,"+50 24 44.22",6.415,6.4619999999999997,"B8V            ","B8","V         ",343.21770408999998,50.412284849999999,4.5380000000000003]
["HD 216534","","*  ","","",343.24409706,"22 52 58.5",49.864777089999997,"+49 51 53.19",8.4600000000000009,8.4700000000000006,"B3V            ","B3","V         ",343.24409706,49.864777089999997,2.5299999999999994]
["V377 Lac","Var","LP*",null,"",343.29740411,"22 53 11.3",40.167361270000001,"+40 10 2.5",6.2439999999999998,6.3170000000000002,"B7III-IV       ","B7","III-IV    ",343.29740411,40.167361270000001,4.6829999999999998]
["HD 216629","","Be*","","Be",343.31501616999998,"22 53 15.6",62.145826100000001,"+62 8 44.97",9.89,9.31,"B2IV-Vne       ","B2","IV-Vne    ",343.31501616999998,62.145826100000001,1.6899999999999995]
["HD 216658","","*i*","","",343.37834199999998,"22 53 30.8",62.134906000000001,"+62 8 5.66",9.48,8.92,"B0.5V          ","B0","V         ",343.37834199999998,62.134906000000001,2.08]
["V454 Cep              ","var","Al*","","",343.47517110000001,"22 53 54",62.596768040000001," 62 35 48.36",9.59,9.11,"B1V            ","B1","V         ",343.47517110000001,62.596768040000001,1.8900000000000006]
["BD+61 2365               ",{"$f":"IF(LEFT(A2515,2)=\"V*\",\"var\",\"\")","v":""},"*iA","","",343.57516700000002,"22 54 18",62.665314000000002," 62 39 55.13",9.59,9.24,"B1V            ","B1","V         ",343.57516700000002,62.665314000000002,1.7599999999999998]
["HD 216684","","*  ",null,"",343.58837956000002,"22 54 21.2",43.52851287,"+43 31 42.64",7.74,7.76,"B8V            ","B8","V         ",343.58837956000002,43.52851287,3.24]
["BD+61 2366               ",{"$f":"IF(LEFT(A2517,2)=\"V*\",\"var\",\"\")","v":""},"*iA","","",343.65157119999998,"22 54 36.3",62.612455599999997," 62 36 44.84",10.32,9.7100000000000009,"B1V            ","B1","V         ",343.65157119999998,62.612455599999997,1.2899999999999991]
["HD 240110","","*  ",null,"",343.68800420000002,"22 54 45.1",58.334883599999998,"+58 20 5.58",10.08,9.7899999999999991,"B9V            ","B9","V         ",343.68800420000002,58.334883599999998,1.2100000000000009]
["HR 8723","","*i*",null,"",343.93544723999997,"22 55 44.5",36.351389679999997,"+36 21 5",5.6769999999999996,5.7279999999999998,"B7III          ","B7","III       ",343.93544723999997,36.351389679999997,5.2720000000000002]
["HD 216851","","Be*","","Be",343.94609641,"22 55 47",43.559286700000001,"+43 33 33.43",8.02,7.97,"B3V:n          ","B3","V:n       ",343.94609641,43.559286700000001,3.0300000000000002]
["HD 216926","","*iA",null,"",343.96924640999998,"22 55 52.6",63.473091230000001,"+63 28 23.12",9.07,8.8699999999999992,"B9III:         ","B9","III:      ",343.96924640999998,63.473091230000001,2.1300000000000008]
["EN Lac","Var","bC*","","",344.09845691999999,"22 56 23.6",41.603873270000001,"+41 36 13.94",5.4390000000000001,5.5839999999999996,"B2IV           ","B2","IV        ",344.09845691999999,41.603873270000001,5.4160000000000004]
["KZ Cep","Var","bC*","","",344.12877900000001,"22 56 30.9",62.868608000000002,"+62 52 6.98",8.1999999999999993,7.74,"B0V            ","B0","V         ",344.12877900000001,62.868608000000002,3.26]
["BD+62 2136A","","*i*","","",344.12880000000001,"22 56 30.9",62.868600000000001,"+62 52 6.96",8.1999999999999993,7.8,"B0.5Vn         ","B0","Vn        ",344.12880000000001,62.868600000000001,3.2]
["HD 217061                ",{"$f":"IF(LEFT(A2525,2)=\"V*\",\"var\",\"\")","v":""},"Be*","","Be",344.17730458,"22 56 42.5",62.624876469999997," 62 37 29.55",9.3699999999999992,8.8000000000000007,"B1Vn           ","B1","Vn        ",344.17730458,62.624876469999997,2.1999999999999993]
["HD 217072","","*  ",null,"",344.26824920000001,"22 57 4.3",55.686158900000002,"+55 41 10.17",9.1300000000000008,8.9,"B8p            ","B8","p         ",344.26824920000001,55.686158900000002,2.0999999999999996]
["HR 8731","","Be*",null,"Be",344.26875906999999,"22 57 4.5",48.684069399999998,"+48 41 2.64",5.33,5.42,"B4IIIpe        ","B4","IIIpe     ",344.26875906999999,48.684069399999998,5.58]
["HD 240132","","*  ",null,"",344.35822999999999,"22 57 25.9",58.877431100000003,"+58 52 38.75",9.16,9.11,"B8V            ","B8","V         ",344.35822999999999,58.877431100000003,1.8900000000000006]
["HR 8733","","*  ","","",344.41974304000001,"22 57 40.7",39.308775969999999,"+39 18 31.59",6.03,6.18,"B2IV-V         ","B2","IV-V      ",344.41974304000001,39.308775969999999,4.82]
["GT Cep","Var","Al*",null,"",344.44714035999999,"22 57 47.3",68.40723251,"+68 24 26.03",8.49,8.25,"B3V+A0:        ","B3","V+A0:     ",344.44714035999999,68.40723251,2.75]
["BD+62 2142","","*iA",null,"",344.51637499999998,"22 58 3.9",63.362428000000001,"+63 21 44.74",9.3000000000000007,9.0399999999999991,"B5V             ","B5","V         ",344.51637499999998,63.362428000000001,1.9600000000000009]
["BD+62 2142","","*iA",null,"",344.51637499999998,"22 58 3.9",63.362428000000001,"+63 21 44.74",9.3000000000000007,9.0399999999999991,"B5V             ","B5","V         ",344.51637499999998,63.362428000000001,1.9600000000000009]
["HD 217297","","*iA","","",344.63854409999999,"22 58 33.2",63.706748679999997,"+63 42 24.29",7.73,7.41,"B1.5V          ","B1","V         ",344.63854409999999,63.706748679999997,3.59]
["NY Cep","Var","Al*","","",344.66581925999998,"22 58 39.7",63.07714833,"+63 4 37.73",7.74,7.44,"B0IV           ","B0","IV        ",344.66581925999998,63.07714833,3.5599999999999996]
["HR 8745","","*  ",null,"",344.78751649999998,"22 59 9",59.814655250000001,"+59 48 52.75",6.4640000000000004,6.4569999999999999,"B9III          ","B9","III       ",344.78751649999998,59.814655250000001,4.5430000000000001]
["BD+62 2150","","*iA","","",344.81878799999998,"22 59 16.5",62.863793999999999,"+62 51 49.65",10.18,9.82,"B3V            ","B3","V         ",344.81878799999998,62.863793999999999,1.1799999999999997]
["BD+61 2380","","Be*",null,"Be",344.84276699999998,"22 59 22.2",61.973044000000002,"+61 58 22.95",9.31,9.14,"B9V            ","B9","V         ",344.84276699999998,61.973044000000002,1.8599999999999994]
["HD 217463","","*  ","","",344.92864018,"22 59 42.8",62.77731069,"+62 46 38.31",9.49,9.07,"B1.5Vn         ","B1","Vn        ",344.92864018,62.77731069,1.9299999999999997]
["HD 240153","","*  ",null,"",345.07585532000002,"23 0 18.2",58.485591040000003,"+58 29 8.12",9.3800000000000008,9.2799999999999994,"B5V             ","B5","V         ",345.07585532000002,58.485591040000003,1.7200000000000006]
["HD 240153","","*  ",null,"",345.07585532000002,"23 0 18.2",58.485591040000003,"+58 29 8.12",9.3800000000000008,9.2799999999999994,"B5V             ","B5","V         ",345.07585532000002,58.485591040000003,1.7200000000000006]
["BD+62 2154               ",{"$f":"IF(LEFT(A2541,2)=\"V*\",\"var\",\"\")","v":""},"*iA","","",345.1339979,"23 0 32.1",63.516344400000001," 63 30 58.83",9.76,9.33,"B1V            ","B1","V         ",345.1339979,63.516344400000001,1.67]
["HR 8753","","*  ","","",345.17672842000002,"23 0 42.4",31.082964839999999,"+31 4 58.67",6.56,6.6,"B9mnp          ","B9","mnp       ",345.17672842000002,31.082964839999999,4.4000000000000004]
["BD+62 2155","","SB*","","",345.22730662999999,"23 0 54.5",62.881663330000002,"+62 52 53.98",10.52,9.81,"B2IV           ","B2","IV        ",345.22730662999999,62.881663330000002,1.1899999999999995]
["HR 8758","","Be*",null,"Be",345.22811837,"23 0 54.7",38.707843920000002,"+38 42 28.23",6.44,6.5549999999999997,"B3Vpe          ","B3","Vpe       ",345.22811837,38.707843920000002,4.4450000000000003]
["HD 217657","","*iA","","",345.2997254,"23 1 11.9",62.941958900000003,"+62 56 31.05",8.5299999999999994,8.15,"B0.5V          ","B0","V         ",345.2997254,62.941958900000003,2.8499999999999996]
["HD 217672","","*  ",null,"",345.36369669999999,"23 1 27.2",58.264190800000002,"+58 15 51.08",8.19,8.11,"B8V            ","B8","V         ",345.36369669999999,58.264190800000002,2.8900000000000006]
["omi And","","Be*",null,"Be",345.48026914000002,"23 1 55.2",42.325981499999997,"+42 19 33.53",3.552,3.633,"B6IIIpe+...    ","B6","IIIpe+... ",345.48026914000002,42.325981499999997,7.367]
["BD+56 2930               ",{"$f":"IF(LEFT(A2548,2)=\"V*\",\"var\",\"\")","v":""},"*  ","","",345.5197483,"23 2 4.7",57.546106100000003," 57 32 45.98",10.02,9.76,"B1IV           ","B1","IV        ",345.5197483,57.546106100000003,1.2400000000000002]
["HD 217903","","*iN","","",345.56554799999998,"23 2 15.7",72.730393019999994,"+72 43 49.41",8.16,8.07,"B9V            ","B9","V         ",345.56554799999998,72.730393019999994,2.9299999999999997]
["HD 217817","","V* ",null,"",345.60489314,"23 2 25.1",59.85268069,"+59 51 9.65",6.9729999999999999,6.9889999999999999,"B3V            ","B3","V         ",345.60489314,59.85268069,4.0110000000000001]
["HD 240168                ",{"$f":"IF(LEFT(A2551,2)=\"V*\",\"var\",\"\")","v":""},"*  ","","",345.61677900000001,"23 2 28",56.612039000000003," 56 36 43.34",9.64,9.2100000000000009,"B1III          ","B1","III       ",345.61677900000001,56.612039000000003,1.7899999999999991]
["V638 Cas","Var","a2*",null,"",345.68289971000002,"23 2 43.8",55.236384829999999,"+55 14 10.98",6.4379999999999997,6.516,"B9IIIwe...     ","B9","IIIwe...  ",345.68289971000002,55.236384829999999,4.484]
["HD 240171                ",{"$f":"IF(LEFT(A2553,2)=\"V*\",\"var\",\"\")","v":""},"*  ","","",345.68545749999998,"23 2 44.5",57.142629200000002," 57 8 33.46",10.02,9.92,"B1V            ","B1","V         ",345.68545749999998,57.142629200000002,1.08]
["LN And","Var","bC*","","",345.68811579999999,"23 2 45.1",44.058750660000001,"+44 3 31.5",6.3769999999999998,6.415,"B2V            ","B2","V         ",345.68811579999999,44.058750660000001,4.585]
["HD 217919","","*  ","","",345.75611780000003,"23 3 1.4",63.698152839999999,"+63 41 53.35",8.75,8.24,"B0IV:n         ","B0","IV:n      ",345.75611780000003,63.698152839999999,2.76]
["HD 217979                ",{"$f":"IF(LEFT(A2556,2)=\"V*\",\"var\",\"\")","v":""},"*  ","","",345.83387863000002,"23 3 20.1",63.550547770000001," 63 33 1.97",8.8699999999999992,8.6,"B1V            ","B1","V         ",345.83387863000002,63.550547770000001,2.4000000000000004]
["HD 217966","","*iA",null,"",345.83805566000001,"23 3 21.1",62.642427230000003,"+62 38 32.73",8.1999999999999993,8.16,"B7V            ","B7","V         ",345.83805566000001,62.642427230000003,2.84]
["V387 Cep","Var","LP*","","",345.84881153999999,"23 3 23.7",60.445407189999997,"+60 26 43.46",6.694,6.7389999999999999,"B2V            ","B2","V         ",345.84881153999999,60.445407189999997,4.2610000000000001]
["BD+57 2678","","Be*","","Be",345.90336079999997,"23 3 36.8",58.309749400000001,"+58 18 35.09",10.210000000000001,9.81,"B0.5V          ","B0","V         ",345.90336079999997,58.309749400000001,1.1899999999999995]
["bet Psc","","Be*",null,"Be",345.96922289000003,"23 3 52.6",3.8200461699999999,"+3 49 12.16",4.3760000000000003,4.4859999999999998,"B6Ve           ",{"$f":"+LEFT(L2560,2)","v":"B6"},{"$f":"+IF(MID(L2560,3,1)=\".\",MID(L2560,5,10),MID(L2560,3,10))","v":"Ve        "},345.96922289000003,3.8200461699999999,6.5140000000000002]
["HD 240179","","*  ",null,"",345.9919208,"23 3 58",60.0878522,"+60 5 16.26",9.5,9.2799999999999994,"B5V             ","B5","V         ",345.9919208,60.0878522,1.7200000000000006]
["HD 240179","","*  ",null,"",345.9919208,"23 3 58",60.0878522,"+60 5 16.26",9.5,9.2799999999999994,"B5V             ","B5","V         ",345.9919208,60.0878522,{"$f":"11-K2562","v":1.7200000000000006}]
["HD 240183","","*  ",null,"",346.04277789999998,"23 4 10.2",60.088774700000002,"+60 5 19.58",9.9700000000000006,9.85,"B5V             ","B5","V         ",{"$f":"+F2563","v":346.04277789999998},{"$f":"+H2563","v":60.088774700000002},1.1500000000000004]
["HD 240183","","*  ",null,"",346.04277789999998,"23 4 10.2",60.088774700000002,"+60 5 19.58",9.9700000000000006,9.85,"B5V             ","B5","V         ",346.04277789999998,60.088774700000002,1.1500000000000004]
["BD+62 2166               ",{"$f":"IF(LEFT(A2565,2)=\"V*\",\"var\",\"\")","v":""},"*iA","","",346.18917829999998,"23 4 45.4",63.351481900000003," 63 21 5.33",9.73,9.3000000000000007,"B1V            ","B1","V         ",346.18917829999998,63.351481900000003,1.6999999999999993]
["MARKAB","","V* ","","",346.19022268999998,"23 4 45.6",15.205267149999999,"+15 12 18.96",2.4500000000000002,2.4900000000000002,"B9III          ","B9","III       ",346.19022268999998,15.205267149999999,8.51]
["HD 218229","","*iA",null,"",346.33894633,"23 5 21.3",62.355262330000002,"+62 21 18.94",8.36,8.19,"B8III          ","B8","III       ",346.33894633,62.355262330000002,2.8100000000000005]
["HD 218323","","*iA","","",346.48627715999999,"23 5 56.7",64.295153450000001,"+64 17 42.55",8.11,7.65,"B0III          ","B0","III       ",346.48627715999999,64.295153450000001,3.3499999999999996]
["HD 218342","","*  ","","",346.53740667,"23 6 8.9",63.212799590000003,"+63 12 46.07",7.77,7.46,"B0IV           ","B0","IV        ",346.53740667,63.212799590000003,3.54]
["HD 218344","","*  ","","",346.63407339000003,"23 6 32.1",51.077196209999997,"+51 4 37.9",7.2949999999999999,7.4189999999999996,"B2V            ","B2","V         ",346.63407339000003,51.077196209999997,3.5810000000000004]
["1 Cas","","*  ","","",346.65340773999998,"23 6 36.8",59.419759919999997,"+59 25 11.13",4.78,4.84,"B0.5IV         ","B0","IV        ",346.65340773999998,59.419759919999997,6.16]
["HD 236044                ",{"$f":"IF(LEFT(A2572,2)=\"V*\",\"var\",\"\")","v":""},"*  ","","",346.74541004000002,"23 6 58.8",54.746782099999997," 54 44 48.41",9.69,9.59,"B1V            ","B1","V         ",346.74541004000002,54.746782099999997,1.4100000000000001]
["HD 218393","","Be*","","Be",346.77588476,"23 7 6.2",50.192357280000003,"+50 11 32.48",7.41,7.02,"B3pe+K1III     ","B3","pe+K1III  ",346.77588476,50.192357280000003,3.9800000000000004]
["HR 8803","","*  ","","",346.79355385000002,"23 7 10.4",59.727394199999999,"+59 43 38.61",6.3860000000000001,6.4180000000000001,"B2V            ","B2","V         ",346.79355385000002,59.727394199999999,4.5819999999999999]
["HD 218450","","*iA",null,"",346.80490394999998,"23 7 13.1",62.676891650000002,"+62 40 36.8",8.64,8.58,"B9Vn           ","B9","Vn        ",346.80490394999998,62.676891650000002,2.42]
["HR 8800","","Al*","","",346.82499797999998,"23 7 17.9",46.068146910000003,"+46 4 5.32",6.5960000000000001,6.6539999999999999,"B2V            ","B2","V         ",346.82499797999998,46.068146910000003,4.3460000000000001]
["HR 8808","","*  ",null,"",346.94894416,"23 7 47.7",63.633464869999997,"+63 38 0.47",6.2089999999999996,6.2489999999999997,"B3V            ","B3","V         ",346.94894416,63.633464869999997,4.7510000000000003]
["HD 218674","","Be*","","Be",347.31977154999998,"23 9 16.7",49.650613470000003,"+49 39 2.2",6.7130000000000001,6.758,"B3IV...        ","B3","IV...     ",347.31977154999998,49.650613470000003,4.242]
["HD 218624","","*i*",null,"",347.34450452999999,"23 9 22.6",18.735921560000001,"+18 44 9.31",6.68,6.75,"B9V            ","B9","V         ",347.34450452999999,18.735921560000001,4.25]
["BD+60 2493","","Em*","Em","",347.3952883,"23 9 34.8",61.465795,"+61 27 56.86",10.02,9.36,"B0.5pe         ","B0","pe        ",347.3952883,61.465795,1.6400000000000006]
["HD 240206","","*  ",null,"",347.42987829999998,"23 9 43.1",59.958302199999999,"+59 57 29.88",9.9700000000000006,9.73,"B8V            ","B8","V         ",347.42987829999998,59.958302199999999,1.2699999999999996]
["58 Peg","","*  ",null,"",347.50608603000001,"23 10 1.4",9.8220814500000007,"+9 49 19.49",5.3159999999999998,5.3840000000000003,"B9III          ","B9","III       ",347.50608603000001,9.8220814500000007,5.6159999999999997]
["PV Cas","Var","Al*",null,"",347.51073000000002,"23 10 2.5",59.201707200000001,"+59 12 6.14",9.98,9.86,"B6V            ","B6","V         ",347.51073000000002,59.201707200000001,1.1400000000000006]
["HD 240221","","*i*",null,"",348.05079330000001,"23 12 12.1",60.666327500000001,"+60 39 58.77",9.09,8.82,"B5III           ","B5","III       ",348.05079330000001,60.666327500000001,2.1799999999999997]
["HD 240221","","*i*",null,"",348.05079330000001,"23 12 12.1",60.666327500000001,"+60 39 58.77",9.09,8.82,"B5III           ","B5","III       ",348.05079330000001,60.666327500000001,2.1799999999999997]
["HD 240227","","*  ",null,"",348.16692899999998,"23 12 40",60.716774999999998,"+60 43 0.38",8.7100000000000009,8.5500000000000007,"B5V             ","B5","V         ",348.16692899999998,60.716774999999998,2.4499999999999993]
["HD 240227","","*  ",null,"",348.16692899999998,"23 12 40",60.716774999999998,"+60 43 0.38",8.7100000000000009,8.5500000000000007,"B5V             ","B5","V         ",348.16692899999998,60.716774999999998,2.4499999999999993]
["HD 219188","","*  ","","",348.50214842999998,"23 14 0.5",4.9971018100000002,"+4 59 49.56",6.9,7.06,"B0.5III        ","B0","III       ",348.50214842999998,4.9971018100000002,3.9400000000000004]
["HD 240233","","*  ",null,"",348.59713040000003,"23 14 23.3",60.7699389,"+60 46 11.78",9.6300000000000008,9.49,"B9V            ","B9","V         ",348.59713040000003,60.7699389,1.5099999999999998]
["BD+60 2504","","*  ",null,"",348.6725462,"23 14 41.4",61.526143300000001,"+61 31 34.11",10.11,9.9,"B8V            ","B8","V         ",348.6725462,61.526143300000001,1.0999999999999996]
["BD+61 2408","","Be*","","Be",348.86633379,"23 15 27.9",62.079048,"+62 4 44.57",10.28,9.6999999999999993,"B0III:p...     ","B0","III:p...  ",348.86633379,62.079048,1.3000000000000007]
["V649 Cas","Var","Al*","","",349.11271209,"23 16 27",61.962946760000001,"+61 57 46.6",6.76,6.55,"B0Vn           ","B0","Vn        ",349.11271209,61.962946760000001,4.45]
["HD 240245","","*  ",null,"",349.23463170000002,"23 16 56.3",59.949305299999999,"+59 56 57.49",9.32,9.1999999999999993,"B8V            ","B8","V         ",349.23463170000002,59.949305299999999,1.8000000000000007]
["BD+63 1962               ",{"$f":"IF(LEFT(A2594,2)=\"V*\",\"var\",\"\")","v":""},"*  ","","",349.26547132000002,"23 17 3.7",63.789400200000003," 63 47 21.84",8.66,8.4,"B1III          ","B1","III       ",349.26547132000002,63.789400200000003,2.5999999999999996]
["ET And","Var","a2*",null,"",349.48338328,"23 17 56",45.488923849999999,"+45 29 20.12",6.4509999999999996,6.49,"B9p...         ","B9","p...      ",349.48338328,45.488923849999999,4.51]
["HD 240248","","*  ",null,"",349.48908829999999,"23 17 57.3",60.656683600000001,"+60 39 24.06",8.92,8.84,"B9V            ","B9","V         ",349.48908829999999,60.656683600000001,2.16]
["HD 219855","","Pe*",null,"",349.62014309,"23 18 28.8",58.166935780000003,"+58 10 0.96",8.76,8.59,"B9p            ","B9","p         ",349.62014309,58.166935780000003,2.41]
["HR 8873","","*  ",null,"",349.86422506000002,"23 19 27.4",34.793181959999998,"+34 47 35.45",6.2629999999999999,6.3170000000000002,"B8III          ","B8","III       ",349.86422506000002,34.793181959999998,4.6829999999999998]
["HD 220016","","*  ","","",349.95665195999999,"23 19 49.5",59.633354539999999,"+59 38 0.07",7.92,7.88,"B3V            ","B3","V         ",349.95665195999999,59.633354539999999,3.12]
["BD+60 2520","","*iC","","",349.957696,"23 19 49.8",61.345571999999997,"+61 20 44.05",9.86,9.65,"B3III          ","B3","III       ",349.957696,61.345571999999997,1.3499999999999996]
["HD 220057","","*  ","","",350.00269980000002,"23 20 0.6",61.149845190000001,"+61 8 59.44",6.9539999999999997,6.9450000000000003,"B2IV           ","B2","IV        ",350.00269980000002,61.149845190000001,4.0549999999999997]
["TYC 4279-1068-1","","*  ",null,"",350.10028620000003,"23 20 24",61.042634200000002,"+61 2 33.48",10.119999999999999,9.98,"B6V            ","B6","V         ",350.10028620000003,61.042634200000002,1.0199999999999996]
["HD 240264","","*  ",null,"",350.11956290000001,"23 20 28.6",60.441862200000003,"+60 26 30.7",9.9499999999999993,9.77,"B8V            ","B8","V         ",350.11956290000001,60.441862200000003,1.2300000000000004]
["HD 220116","","Be*","","Be",350.14294993999999,"23 20 34.3",58.277622700000002,"+58 16 39.44",9.1300000000000008,8.6199999999999992,"B0.5Vpe        ","B0","Vpe       ",350.14294993999999,58.277622700000002,2.3800000000000008]
["V812 Cas","Var","a2*",null,"",350.20381388999999,"23 20 48.9",62.412545020000003,"+62 24 45.16",8.2200000000000006,8.1199999999999992,"B9p            ","B9","p         ",350.20381388999999,62.412545020000003,2.8800000000000008]
["HD 240271","","*  ",null,"",350.37468209999997,"23 21 29.9",58.368613600000003,"+58 22 7",10.01,9.5399999999999991,"B9III          ","B9","III       ",350.37468209999997,58.368613600000003,1.4600000000000009]
["BD+60 2525","","*  ","","",350.45076,"23 21 48.1",60.8471069,"+60 50 49.58",9.85,9.64,"B0III-IV       ","B0","III-IV    ",350.45076,60.8471069,1.3599999999999994]
["64 Peg","","*  ",null,"",350.47888690000002,"23 21 54.9",31.81246376,"+31 48 44.86",5.24,5.3380000000000001,"B6III          ","B6","III       ",350.47888690000002,31.81246376,5.6619999999999999]
["BD+59 2708","","*  ",null,"",350.52,"23 22 4.7",60.42,"+60 25 12",10.029999999999999,9.99,"B9V            ","B9","V         ",350.52,60.42,1.0099999999999998]
["BD+61 2440","","*  ",null,"",350.84894600000001,"23 23 23.7",62.015047000000003,"+62 0 54.16",10,9.89,"B8V            ","B8","V         ",350.84894600000001,62.015047000000003,1.1099999999999994]
["HD 220562","","*  ","","",351.03296540999997,"23 24 7.9",57.535511790000001,"+57 32 7.84",7.0110000000000001,6.806,"B2V            ","B2","V         ",351.03296540999997,57.535511790000001,4.194]
["HD 240287","","*  ","","",351.07063579999999,"23 24 16.9",59.208306700000001,"+59 12 29.9",9.86,9.59,"B9V            ","B9","V         ",351.07063579999999,59.208306700000001,1.4100000000000001]
["BD+60 2533","","*iC","","",351.13767983999998,"23 24 33",61.157832790000001,"+61 9 28.19",9.09,8.99,"B9III          ","B9","III       ",351.13767983999998,61.157832790000001,2.0099999999999998]
["HR 8902","","*  ",null,"",351.14545225000001,"23 24 34.9",41.112904819999997,"+41 6 46.45",6.73,6.72,"B8III          ","B8","III       ",351.14545225000001,41.112904819999997,4.28]
["HD 220598","","*  ","","",351.18078400000002,"23 24 43.3",36.362172549999997,"+36 21 43.82",6.89,7.02,"B2V            ","B2","V         ",351.18078400000002,36.362172549999997,3.9800000000000004]
["HD 240293","","*  ",null,"",351.18508420000001,"23 24 44.4",60.082554199999997,"+60 4 57.19",9.3699999999999992,9.31,"B9V            ","B9","V         ",351.18508420000001,60.082554199999997,1.6899999999999995]
["HD 240294","","*  ",null,"",351.1892292,"23 24 45.4",60.194884399999999,"+60 11 41.58",9.86,9.7899999999999991,"B9V            ","B9","V         ",351.1892292,60.194884399999999,1.2100000000000009]
["67 Peg","","*  ",null,"",351.21180020000003,"23 24 50.8",32.384881479999997,"+32 23 5.57",5.48,5.5540000000000003,"B9III          ","B9","III       ",351.21180020000003,32.384881479999997,5.4459999999999997]
["HD 220760","","*  ",null,"",351.45352766000002,"23 25 48.8",59.666960799999998,"+59 40 1.05",8.8000000000000007,8.51,"B9V            ","B9","V         ",351.45352766000002,59.666960799999998,2.4900000000000002]
["V388 And","Var","a2*",null,"",351.78083400999998,"23 27 7.4",42.912008710000002,"+42 54 43.23",5.7329999999999997,5.7439999999999998,"B9III          ","B9","III       ",351.78083400999998,42.912008710000002,5.2560000000000002]
["BD+60 2548","","V* ",null,"",352.01702499999999,"23 28 4",61.353506000000003,"+61 21 12.62",9.82,9.7799999999999994,"B9V            ","B9","V         ",352.01702499999999,61.353506000000003,1.2200000000000006]
["HD 221037","","*iC",null,"",352.02426557000001,"23 28 5.8",61.920343250000002,"+61 55 13.23",8.08,8.1,"B8V            ","B8","V         ",352.02426557000001,61.920343250000002,2.9000000000000004]
["BD+60 2549","","*iC",null,"",352.0418717,"23 28 10",61.151722200000002,"+61 9 6.19",9.56,9.4600000000000009,"B7V            ","B7","V         ",352.0418717,61.151722200000002,1.5399999999999991]
["BD+60 2551","","Pe*",null,"",352.07853299999999,"23 28 18.8",61.196666999999998,"+61 11 48",9.9700000000000006,9.8800000000000008,"B8V            ",{"$f":"+LEFT(L2624,2)","v":"B8"},{"$f":"+IF(MID(L2624,3,1)=\".\",MID(L2624,5,10),MID(L2624,3,10))","v":"V         "},352.07853299999999,61.196666999999998,1.1199999999999992]
["BD+60 2552","","*  ",null,"",352.08388830000001,"23 28 20.1",60.799168899999998,"+60 47 57",10.1,9.92,"B9V            ","B9","V         ",352.08388830000001,60.799168899999998,1.08]
["HD 240308","","*  ",null,"",352.26690349,"23 29 4",59.753050829999999,"+59 45 10.98",8.9,8.4600000000000009,"B6III          ","B6","III       ",352.26690349,59.753050829999999,{"$f":"11-K2626","v":2.5399999999999991}]
["HD 240312","","*  ","","",352.37552742999998,"23 29 30.1",59.603563780000002,"+59 36 12.82",8.61,8.27,"B2V            ","B2","V         ",{"$f":"+F2627","v":352.37552742999998},{"$f":"+H2627","v":59.603563780000002},2.7300000000000004]
["HD 221237","","*i*",null,"",352.4678179,"23 29 52.2",58.548447199999998,"+58 32 54.4",7.1,7.09,"B9V            ","B9","V         ",352.4678179,58.548447199999998,3.91]
["HD 236150","","*  ",null,"",352.78204769000001,"23 31 7.6",55.747774530000001,"+55 44 51.98",9.17,9.07,"B8V            ","B8","V         ",352.78204769000001,55.747774530000001,1.9299999999999997]
["HR 8936","","*  ",null,"",353.10327738000001,"23 32 24.7",34.952340489999997,"+34 57 8.42",6.6040000000000001,6.6529999999999996,"B8V            ","B8","V         ",353.10327738000001,34.952340489999997,4.3470000000000004]
["HD 221515","","*  ",null,"",353.13521437000003,"23 32 32.4",48.372298890000003,"+48 22 20.27",8.59,8.5500000000000007,"B9V            ","B9","V         ",353.13521437000003,48.372298890000003,2.4499999999999993]
["HD 221711","","*  ","","",353.53865518999999,"23 34 9.2",55.488777890000001,"+55 29 19.6",7.44,7.53,"B2V            ","B2","V         ",353.53865518999999,55.488777890000001,3.4699999999999998]
["HD 240332","","*  ",null,"",353.54717290000002,"23 34 11.3",57.517240000000001,"+57 31 2.06",9.8800000000000008,9.6,"B5V             ","B5","V         ",353.54717290000002,57.517240000000001,1.4000000000000004]
["HD 240332","","*  ",null,"",353.54717290000002,"23 34 11.3",57.517240000000001,"+57 31 2.06",9.8800000000000008,9.6,"B5V             ","B5","V         ",353.54717290000002,57.517240000000001,1.4000000000000004]
["HD 221775","","*  ",null,"",353.69748647,"23 34 47.3",49.08736888,"+49 5 14.52",9.15,9.1199999999999992,"B9V            ","B9","V         ",353.69748647,49.08736888,1.8800000000000008]
["HD 221782","","*  ",null,"",353.70755830000002,"23 34 49.8",52.028869999999998,"+52 1 43.93",9.27,9.3000000000000007,"B8mp...        ","B8","mp...     ",353.70755830000002,52.028869999999998,1.6999999999999993]
["HD 240336","","*  ",null,"",353.88745119999999,"23 35 32.9",58.030510599999999,"+58 1 49.83",10.27,9.91,"B8V            ","B8","V         ",353.88745119999999,58.030510599999999,1.0899999999999999]
["HD 221935","","*  ",null,"",353.96089269999999,"23 35 50.6",60.902530089999999,"+60 54 9.1",8.59,8.41,"B7IV           ","B7","IV        ",353.96089269999999,60.902530089999999,2.59]
["BD+60 2587","","*  ",null,"",354.03822960000002,"23 36 9.1",61.785246700000002,"+61 47 6.88",9.85,9.48,"B5V             ","B5","V         ",354.03822960000002,61.785246700000002,1.5199999999999996]
["BD+60 2587","","*  ",null,"",354.03822960000002,"23 36 9.1",61.785246700000002,"+61 47 6.88",9.85,9.48,"B5V             ","B5","V         ",354.03822960000002,61.785246700000002,1.5199999999999996]
["HD 240338","","*  ",null,"",354.04224238,"23 36 10.1",58.781811930000003,"+58 46 54.52",9.77,9.41,"B8V            ","B8","V         ",354.04224238,58.781811930000003,1.5899999999999999]
["BD+58 2620","","*  ",null,"",354.0512913,"23 36 12.3",59.222735800000002,"+59 13 21.84",10.18,9.75,"B6V            ","B6","V         ",354.0512913,59.222735800000002,1.25]
["BD+60 2590","","*  ",null,"",354.13902250000001,"23 36 33.3",61.207869700000003,"+61 12 28.33",9.89,9.74,"B9V            ","B9","V         ",354.13902250000001,61.207869700000003,1.2599999999999998]
["HD 222046","","*  ",null,"",354.25608460000001,"23 37 1.4",48.5761258,"+48 34 34.05",8.57,8.6199999999999992,"B9V            ","B9","V         ",354.25608460000001,48.5761258,2.3800000000000008]
["HR 8962","","*  ",null,"",354.38351167000002,"23 37 32",44.428992299999997,"+44 25 44.37",5.7530000000000001,5.8170000000000002,"B8V            ","B8","V         ",354.38351167000002,44.428992299999997,5.1829999999999998]
["HD 240344","","*  ",null,"",354.41582290000002,"23 37 39.7",60.385762200000002,"+60 23 8.74",9.42,8.9700000000000006,"B5V             ","B5","V         ",354.41582290000002,60.385762200000002,2.0299999999999994]
["HD 240344","","*  ",null,"",354.41582290000002,"23 37 39.7",60.385762200000002,"+60 23 8.74",9.42,8.9700000000000006,"B5V             ","B5","V         ",354.41582290000002,60.385762200000002,2.0299999999999994]
["HD 222142","","*iN",null,"",354.46499248999999,"23 37 51.5",48.496569899999997,"+48 29 47.65",9.66,9.5500000000000007,"B8V            ","B8","V         ",354.46499248999999,48.496569899999997,1.4499999999999993]
["HD 240348","","*  ",null,"",354.49224600000002,"23 37 58.1",59.831499999999998,"+59 49 53.39",10.039999999999999,9.32,"B9V            ","B9","V         ",354.49224600000002,59.831499999999998,1.6799999999999997]
["iot And","","*  ",null,"",354.53417207000001,"23 38 8.2",43.268073579999999,"+43 16 5.06",4.1900000000000004,4.3,"B8V            ","B8","V         ",354.53417207000001,43.268073579999999,6.7]
["18 And","","*  ",null,"",354.78471704999998,"23 39 8.3",50.471732719999999,"+50 28 18.23",5.24,5.35,"B9Ve           ","B9","Ve        ",354.78471704999998,50.471732719999999,5.65]
["BD+60 2600","","Be*",null,"Be",355.077383,"23 40 18.5",61.345492,"+61 20 43.77",9.5299999999999994,9.34,"B9V            ","B9","V         ",355.077383,61.345492,1.6600000000000001]
["HD 222517","","*  ",null,"",355.27505209999998,"23 41 6",44.395944999999998,"+44 23 45.4",8.67,8.59,"B9V            ","B9","V         ",355.27505209999998,44.395944999999998,2.41]
["HD 222568                ",{"$f":"IF(LEFT(A2654,2)=\"V*\",\"var\",\"\")","v":""},"*  ","","",355.29630394999998,"23 41 11.1",68.359884390000005," 68 21 35.58",8.0299999999999994,7.71,"B1IV           ","B1","IV        ",355.29630394999998,68.359884390000005,3.29]
["HD 222647","","*  ",null,"",355.57000548000002,"23 42 16.8",61.491104040000003,"+61 29 27.97",8.83,8.7899999999999991,"B7V            ","B7","V         ",355.57000548000002,61.491104040000003,2.2100000000000009]
["HD 222749","","*  ",null,"",355.77923500000003,"23 43 7",44.405435799999999,"+44 24 19.56",8.6199999999999992,8.5399999999999991,"B9V            ","B9","V         ",355.77923500000003,44.405435799999999,2.4600000000000009]
["TYC 4281-1700-1","","*  ","","",355.81042120000001,"23 43 14.5",61.462880599999998,"+61 27 46.37",10.26,9.84,"B0.5IV         ","B0","IV        ",355.81042120000001,61.462880599999998,1.1600000000000001]
["BD+60 2617","","*  ",null,"",356.35671580000002,"23 45 25.6",61.039710599999999,"+61 2 22.95",10.23,9.7200000000000006,"B9V            ","B9","V         ",356.35671580000002,61.039710599999999,1.2799999999999994]
["BD+61 2515","","*  ","","",356.43288289999998,"23 45 43.8",62.292000299999998,"+62 17 31.2",10.4,9.98,"B0.5V          ","B0","V         ",356.43288289999998,62.292000299999998,1.0199999999999996]
["HR 9005","","*  ","","",356.65307539999998,"23 46 36.7",66.782242710000006,"+66 46 56.07",5.8879999999999999,5.9379999999999997,"B2IV           ","B2","IV        ",356.65307539999998,66.782242710000006,5.0620000000000003]
["HR 9011","","V* ","","",356.88770583000002,"23 47 33",46.8325605,"+46 49 57.21",5.952,6.0839999999999996,"B3IV           ","B3","IV        ",356.88770583000002,46.8325605,4.9160000000000004]
["BD+59 2776","","*  ",null,"",357.15628959999998,"23 48 37.5",60.486241100000001,"+60 29 10.46",9.8800000000000008,9.5500000000000007,"B9V            ","B9","V         ",357.15628959999998,60.486241100000001,1.4499999999999993]
["HD 223501","","Be*","","Be",357.47133135000001,"23 49 53.1",62.214092180000002,"+62 12 50.73",7.74,7.74,"B2Vne...       ","B2","Vne...    ",357.47133135000001,62.214092180000002,3.26]
["HD 223579","","*  ",null,"",357.6247204,"23 50 29.9",62.182811399999999,"+62 10 58.12",9.1300000000000008,9.02,"B8V            ","B8","V         ",357.6247204,62.182811399999999,1.9800000000000004]
["BD+60 2631","","*  ","","",358.05408,"23 52 12.9",60.916181100000003,"+60 54 58.25",10.050000000000001,9.6199999999999992,"B0III          ","B0","III       ",358.05408,60.916181100000003,1.3800000000000008]
["BD+60 2632","","*  ","","",358.16936329999999,"23 52 40.6",60.993607500000003,"+60 59 36.98",10.11,9.7200000000000006,"B0V            ","B0","V         ",358.16936329999999,60.993607500000003,1.2799999999999994]
["HD 223924","","*  ","","",358.40226031999998,"23 53 36.5",56.819898369999997,"+56 49 11.63",8.2100000000000009,8.1999999999999993,"B1.5V          ","B1","V         ",358.40226031999998,56.819898369999997,2.8000000000000007]
["BD+59 2786","","Em*","Em","",358.48568299999999,"23 53 56.5",60.373811000000003,"+60 22 25.71",10.27,9.6,"B0III          ","B0","III       ",358.48568299999999,60.373811000000003,1.4000000000000004]
["HD 223980","","*  ",null,"",358.52999039999997,"23 54 7.1",57.1999469,"+57 11 59.8",8.5299999999999994,8.4499999999999993,"B9V            ","B9","V         ",358.52999039999997,57.1999469,2.5500000000000007]
["BD+61 2561","","*  ",null,"",358.60031300000003,"23 54 24",61.887511000000003,"+61 53 15.03",9.52,9.39,"B9V            ","B9","V         ",358.60031300000003,61.887511000000003,1.6099999999999994]
["HD 240439","","*  ",null,"",358.72149669999999,"23 54 53.1",60.556291700000003,"+60 33 22.65",9.48,9.26,"B7V            ","B7","V         ",358.72149669999999,60.556291700000003,1.7400000000000002]
["26 Psc","","*  ",null,"",358.78247111000002,"23 55 7.7",7.0709714799999999,"+7 4 15.49",6.1669999999999998,6.2069999999999999,"B9V            ","B9","V         ",358.78247111000002,7.0709714799999999,4.7930000000000001]
["HR 9052","","*  ","","",358.89099737999999,"23 55 33.8",57.412168540000003,"+57 24 43.8",6.181,6.0449999999999999,"B0.5II-III     ","B0","II-III    ",358.89099737999999,57.412168540000003,4.9550000000000001]
["BD+62 2327","","*  ",null,"",358.99312099999997,"23 55 58.3",62.867792000000001,"+62 52 4.05",9.43,9.26,"B9V            ","B9","V         ",358.99312099999997,62.867792000000001,1.7400000000000002]
["HD 240450","","*  ",null,"",359.06438480000003,"23 56 15.4",60.292536810000001,"+60 17 33.13",8.9499999999999993,8.7200000000000006,"B8V            ","B8","V         ",359.06438480000003,60.292536810000001,2.2799999999999994]
["BD+60 2645","","*  ",null,"",359.20994200000001,"23 56 50.3",61.650953000000001,"+61 39 3.43",9.7200000000000006,9.42,"B3V            ","B3","V         ",359.20994200000001,61.650953000000001,1.58]
["BD+60 2645a              ",{"$f":"IF(LEFT(A2677,2)=\"V*\",\"var\",\"\")","v":""},"Em*","Em","",359.2181367,"23 56 52.3",61.227283100000001," 61 13 38.21",10.220000000000001,9.8699999999999992,"B1ne           ","B1","ne        ",359.2181367,61.227283100000001,1.1300000000000008]
["HD 240452","","*  ",null,"",359.22029959999998,"23 56 52.8",60.356070799999998,"+60 21 21.85",9.8800000000000008,9.51,"B7III          ","B7","III       ",359.22029959999998,60.356070799999998,1.4900000000000002]
["BD+61 2570","","*  ",null,"",359.27142099999998,"23 57 5.1",62.491568999999998,"+62 29 29.64",9.5500000000000007,9.5,"B9V            ","B9","V         ",359.27142099999998,62.491568999999998,1.5]
["BD+60 2646","","*i*",null,"",359.28370000000001,"23 57 8",61.307555999999998,"+61 18 27.2",9.27,9.1300000000000008,"B8V            ","B8","V         ",359.28370000000001,61.307555999999998,1.8699999999999992]
["HD 240453","","*i*",null,"",359.29607170000003,"23 57 11",60.643906100000002,"+60 38 38.06",10.02,9.8000000000000007,"B5V             ","B5","V         ",359.29607170000003,60.643906100000002,1.1999999999999993]
["HD 240453","","*i*",null,"",359.29607170000003,"23 57 11",60.643906100000002,"+60 38 38.06",10.02,9.8000000000000007,"B5V             ","B5","V         ",359.29607170000003,60.643906100000002,1.1999999999999993]
["HD 224403","","*iN","","",359.38545333000002,"23 57 32.5",61.9913089,"+61 59 28.71",7.82,7.68,"B9IV           ","B9","IV        ",359.38545333000002,61.9913089,3.3200000000000003]
["HR 9063","","*  ",null,"",359.38971893000002,"23 57 33.5",60.02359989,"+60 1 24.95",6.4809999999999999,6.4589999999999996,"B9III-IV       ","B9","III-IV    ",359.38971893000002,60.02359989,4.5410000000000004]
["HD 224429","","*i*",null,"",359.44254333999999,"23 57 46.2",11.474376599999999,"+11 28 27.75",6.6870000000000003,6.65,"B9V            ","B9","V         ",359.44254333999999,11.474376599999999,4.3499999999999996]
["BD+61 2576","","*  ",null,"",359.65870000000001,"23 58 38",62.531706,"+62 31 54.14",10.19,9.82,"B9V            ","B9","V         ",359.65870000000001,62.531706,1.1799999999999997]
["LQ And","Var","bC*",null,"",359.69349706999998,"23 58 46.4",46.413177990000001,"+46 24 47.44",6.45,6.5419999999999998,"B4Vne          ","B4","Vne       ",359.69349706999998,46.413177990000001,4.4580000000000002]
["HR 9068","","Be*",null,"Be",359.70514851000001,"23 58 49.2",32.381705740000001,"+32 22 54.14",6.4009999999999998,6.524,"B6IVe          ",{"$f":"+LEFT(L2688,2)","v":"B6"},"IVe       ",359.70514851000001,32.381705740000001,4.476]
["BD+54 3082B","","*i*",null,"",359.75135,"23 59 0.3",55.755668999999997,"+55 45 20.4",7.21,7.24,"B3V            ","B3","V         ",359.75135,55.755668999999997,3.76]
["* sig Cas                ",{"$f":"IF(LEFT(A2690,2)=\"V*\",\"var\",\"\")","v":""},"*i*","","",359.75224248000001,"23 59 0.5",55.75492861," 55 45 17.74",4.891,4.9969999999999999,"B1V            ","B1","V         ",359.75224248000001,55.75492861,{"$f":"11-K2690","v":6.0030000000000001}]
["HD 240471","","*i*",null,"",359.94790879999999,"23 59 47.4",60.072017500000001,"+60 4 19.26",9.4600000000000009,9.3800000000000008,"B9V            ","B9","V         ",{"$f":"+F2691","v":359.94790879999999},{"$f":"+H2691","v":60.072017500000001},{"$f":"11-K2691","v":1.6199999999999992}]

{"sheet":"Extraction","index":3,"n_rows":22,"n_cols":16,"rows_kept":22,"cut":false,"hidden":false,"merged":[]}
["HR 6968","","*i*",null,"",278.20815689,"18 32 49.9",30.554208540000001,"+30 33 15.15",5.3890000000000002,5.4649999999999999,"B8IV           ","B8","IV        ",-7.5999999999999623E-2,4.5350000000000001]
["HR 6971","","Be*",null,"Be",278.34599402999999,"18 33 23",30.892090169999999,"+30 53 31.52",6.4370000000000003,6.5380000000000003,"B4Ve           ","B4","Ve        ",-0.10099999999999998,3.4619999999999997]
["HR 6984","","*  ",null,"",278.80627164999999,"18 35 13.5",34.458022110000002,"+34 27 28.87",5.984,6.0880000000000001,"B5Vne           ","B5","Vne       ",-0.10400000000000009,3.9119999999999999]
["HR 6984","","*  ",null,"",278.80627164999999,"18 35 13.5",34.458022110000002,"+34 27 28.87",5.984,6.0880000000000001,"B5Vne           ","B5","Vne       ",-0.10400000000000009,3.9119999999999999]
["HR 6997","","*  ",null,"",279.15559915,"18 36 37.3",33.469039690000002,"+33 28 8.54",5.3120000000000003,5.41,"B8II-IIIp...   ","B8","II-IIIp...",-9.7999999999999865E-2,4.59]
["HR 7030","","*  ",null,"",280.42213013000003,"18 41 41.3",31.617611499999999,"+31 37 3.4",6.3559999999999999,6.4029999999999996,"B8V            ","B8","V         ",-4.6999999999999709E-2,3.5970000000000004]
["HR 7033","","*  ",null,"",280.53369663000001,"18 42 8",34.746305270000001,"+34 44 46.69",6.34,6.47,"B5V             ","B5","V         ",-0.12999999999999989,3.5300000000000002]
["HR 7033","","*  ",null,"",280.53369663000001,"18 42 8",34.746305270000001,"+34 44 46.69",6.34,6.47,"B5V             ","B5","V         ",-0.12999999999999989,3.5300000000000002]
["HR 7081","","Be*","","Be",281.98905692,"18 47 57.3",31.756834820000002,"+31 45 24.6",5.9119999999999999,6.0469999999999997,"B3IVp          ","B3","IVp       ",-0.13499999999999979,3.9530000000000003]
["8 Lyr","","V* ",null,"",282.44130963999999,"18 49 45.9",32.812823780000002,"+32 48 46.16",5.7629999999999999,5.9139999999999997,"B3IV           ","B3","IV        ",-0.1509999999999998,4.0860000000000003]
["bet Lyr","Var","bL*",null,"",282.51998020000002,"18 50 4.7",33.362669439999998,"+33 21 45.6",3.52,3.52,"B8II-IIIep     ","B8","II-IIIep  ",0,6.48]
["HD 174664","","SB*",null,"",282.52793869999999,"18 50 6.7",33.351855,"+33 21 6.67",7.05,7.13,"B5V             ","B5","V         ",-8.0000000000000071E-2,2.87]
["HD 174664","","SB*",null,"",282.52793869999999,"18 50 6.7",33.351855,"+33 21 6.67",7.05,7.13,"B5V             ","B5","V         ",-8.0000000000000071E-2,2.87]
["HR 7115","","*  ",null,"",282.90215296000002,"18 51 36.5",36.539088919999998,"+36 32 20.72",5.9930000000000003,6.09,"B6IV           ","B6","IV        ",-9.6999999999999531E-2,3.91]
["HD 175081","","*i*",null,"",283.00626044000001,"18 52 1.5",37.516525209999998,"+37 30 59.49",7.27,7.34,"B5n             ","B5","n         ",-7.0000000000000284E-2,2.66]
["HD 175081","","*i*",null,"",283.00626044000001,"18 52 1.5",37.516525209999998,"+37 30 59.49",7.27,7.34,"B5n             ","B5","n         ",-7.0000000000000284E-2,2.66]
["11 Lyr","","*  ","","",283.43149629999999,"18 53 43.5",36.971719999999998,"+36 58 18.19",5.4329999999999998,5.569,"B2.5V          ","B2","V         ",-0.13600000000000012,4.431]
["HD 175885","","*i*",null,"",284.00701413000002,"18 56 1.6",33.785589450000003,"+33 47 8.12",8.11,8.1300000000000008,"B9V            ","B9","V         ",-2.000000000000135E-2,1.8699999999999992]
["V542 Lyr","Var","Al*",null,"",284.50790827999998,"18 58 1.8",38.266189169999997,"+38 15 58.28",5.798,5.8860000000000001,"B7IV           ","B7","IV        ",-8.8000000000000078E-2,4.1139999999999999]
["SULAFAT","","*i*",null,"",284.73592673000002,"18 58 56.6",32.689555640000002,"+32 41 22.4",3.2,3.25,"B9III          ","B9","III       ",-4.9999999999999822E-2,6.75]
["V545 Lyr","Var","LP*",null,"",284.80121578000001,"18 59 12.2",39.217322520000003,"+39 13 2.36",6.2489999999999997,6.4039999999999999,"B5IV            ","B5","IV        ",-0.15500000000000025,3.5960000000000001]
["V545 Lyr","Var","LP*",null,"",284.80121578000001,"18 59 12.2",39.217322520000003,"+39 13 2.36",6.2489999999999997,6.4039999999999999,"B5IV            ","B5","IV        ",-0.15500000000000025,3.5960000000000001]

{"sheet":"Data","index":4,"n_rows":7,"n_cols":3,"rows_kept":7,"cut":false,"hidden":false,"merged":[]}
[]
["Nb Stars",null,{"$f":"+COUNTA(Base!A:A)-1","v":2690}]
[]
["Champ",1,5]
[null,2,10]
[]
["Taille",10]

{"sheet":"Simbad","index":5,"n_rows":53,"n_cols":3,"rows_kept":53,"cut":false,"hidden":false,"merged":[]}
[]
[null,"*"]
[null,"**","double"]
[null,"*i*","star in double"]
[null,"*iA","Association"]
[null,"*iC","Cluster"]
[null,"*iN","Nébuleuse"]
[null,"?  "]
[null,"a2*","alp2 Cvn"]
[null,"Al*","EB Algol"]
[null,"bC*","Bet Cep"]
[null,"Be*","Be"]
[null,"bL*","Bet Lyr"]
[null,"C* ","Carbon"]
[null,"Ce*","Cepheid"]
[null,"Cl*","Cluster"]
[null,"dS*","Del Sct"]
[null,"EB*"]
[null,"El*","Ellipsoidal"]
[null,"Em*","Em"]
[null,"HB*","Horizontal Branch"]
[null,"HXB","HXB"]
[null,"IR ","IR"]
[null,"Ir*","Var Ir"]
[null,"LP*","Long Period"]
[null,"LXB"]
[null,"No*","Nova"]
[null,"OpC","Open Cluster"]
[null,"Or*","Orion type var"]
[null,"pA*","post AGB"]
[null,"Pe*","Peculiar"]
[null,"PM*","High proper-motion Star  "]
[null,"pr*","pre main sequence"]
[null,"Pu*","Pulsating var"]
[null,"RI*","Rapid var"]
[null,"RNe","Reflexion nebula"]
[null,"Ro*","Rotationally variable Star "]
[null,"RR*","RR Lyr"]
[null,"RV*","RV Tau"]
[null,"s*b","blue super giant"]
[null,"SB*","spectroscopic binary"]
[null,"SN*","SN"]
[null,"sr*","Semi-regular pulsating Star  "]
[null,"TT*","T Tau"]
[null,"TT?","T Tau"]
[null,"UV ","UV"]
[null,"V* ","Var"]
[null,"WD*","White dwarf"]
[null,"WR*","Wolf Rayet"]
[null,"WU*","W Uma"]
[null,"Y*?","young stellar object possible"]
[null,"Y*O","Young stellar object"]
[null,"ZZ*","Pulsating White Dwarf   "]